ACCESSION: MSBNK-NAIST-KNA00736
RECORD_TITLE: L-Asparagine; LC-ESI-ITFT; MS; NEG
DATE: 2016.01.19 (Created 2009.11.19, modified 2011.08.03)
AUTHORS: Takahashi H, Kanaya S, Ogasawara N, Graduate School of Information Science, NAIST
LICENSE: CC BY-SA

CH$NAME: L-Asparagine
CH$NAME: 2-Aminosuccinamic acid
CH$COMPOUND_CLASS: Natural Product
CH$FORMULA: C4H8N2O3
CH$EXACT_MASS: 132.05349
CH$SMILES: NC(=O)C[C@@H](N)C(O)=O
CH$IUPAC: InChI=1S/C4H8N2O3/c5-2(4(8)9)1-3(6)7/h2H,1,5H2,(H2,6,7)(H,8,9)/t2-/m0/s1
CH$LINK: CAS 70-47-3
CH$LINK: CHEBI 17196
CH$LINK: KEGG C00152
CH$LINK: KNAPSACK C00001341
CH$LINK: NIKKAJI J9.178B
CH$LINK: PUBCHEM 3452
CH$LINK: INCHIKEY DCXYFEDJOCDNAF-REOHCLBHSA-N
CH$LINK: COMPTOX DTXSID10883220

AC$INSTRUMENT: LTQ Orbitrap XL, Thermo Scientfic
AC$INSTRUMENT_TYPE: LC-ESI-ITFT
AC$MASS_SPECTROMETRY: MS_TYPE MS
AC$MASS_SPECTROMETRY: ION_MODE NEGATIVE
AC$MASS_SPECTROMETRY: COLLISION_ENERGY 35eV
AC$MASS_SPECTROMETRY: IONIZATION ESI
AC$CHROMATOGRAPHY: COLUMN_NAME TOSOH TSKgel ODS-100V 5um Part no. 21456
AC$CHROMATOGRAPHY: FLOW_GRADIENT 0min:3%, 45min:97%, 50min:97%, 50.1:3%, 57min:3% (acetonitrile)
AC$CHROMATOGRAPHY: FLOW_RATE 0.5 ml/min
AC$CHROMATOGRAPHY: RETENTION_TIME 4.594280 min
AC$CHROMATOGRAPHY: SOLVENT A 0.1%formate-water
AC$CHROMATOGRAPHY: SOLVENT B 0.1%formate-acetonitrile

MS$FOCUSED_ION: BASE_PEAK 131.046051

PK$SPLASH: splash10-01q9-0942200000-81b4cffdd320ac5c1eb5
PK$NUM_PEAK: 493
PK$PEAK: m/z int. rel.int.
  100.132409 720.963867 1
  101.648716 714.997070 1
  102.005724 681.265137 1
  103.903286 747.039429 1
  103.919896 1000.393311 2
  105.192392 722.869385 1
  105.712666 804.487671 1
  107.696939 757.668701 1
  109.014063 760.657593 1
  109.226189 697.534424 1
  110.317836 850.407227 1
  110.544979 801.724243 1
  111.019937 2662.138184 4
  111.432819 785.640869 1
  112.282828 802.249756 1
  112.983606 1168.975342 2
  112.985421 36392.308594 57
  112.987463 1104.029053 2
  113.028317 1031.497070 2
  113.031950 1185.700684 2
  113.032631 1107.568481 2
  113.033539 2661.277832 4
  113.035582 108729.203125 169
  113.037399 4361.129883 7
  113.039442 1157.677246 2
  113.635331 765.599121 1
  113.774836 729.370728 1
  113.955496 835.563843 1
  114.013895 828.161621 1
  114.015735 1139.794922 2
  114.016655 813.095337 1
  114.017575 3699.295898 6
  114.019645 118786.453125 185
  114.021485 4715.939941 7
  114.022405 975.446167 2
  114.023556 1339.517822 2
  114.038739 2493.508545 4
  114.911350 783.016602 1
  114.951389 4003.752441 6
  115.022674 2163.058105 3
  115.794485 818.497437 1
  119.524832 1064.170410 2
  119.849649 708.264771 1
  121.072340 1145.824829 2
  121.708597 1126.092896 2
  123.625416 697.118164 1
  123.707000 759.325684 1
  123.951717 3001.193604 5
  124.119794 803.280396 1
  125.872876 965.160278 2
  127.193475 799.053955 1
  127.331807 829.500488 1
  127.389376 720.369019 1
  127.462480 789.673584 1
  127.696890 821.324951 1
  127.943704 853.557861 1
  128.388622 814.970215 1
  128.710246 892.989380 1
  130.955630 707.648438 1
  130.967805 1408.226074 2
  131.019924 3484.991699 5
  131.032676 806.033447 1
  131.033809 915.485840 1
  131.034376 806.369995 1
  131.038627 3869.837402 6
  131.039477 4227.345215 7
  131.041178 5897.272461 9
  131.042311 7228.816406 11
  131.043728 21007.958984 33
  131.045996 642326.250000 999
  131.048546 23435.384766 36
  131.050814 8153.259277 13
  131.052231 2307.312744 4
  131.053365 3602.607910 6
  131.054782 1435.399536 2
  131.057050 1090.498779 2
  131.057900 1037.993652 2
  131.058751 1053.556030 2
  131.072075 3023.733643 5
  131.124539 1411.501221 2
  131.291502 793.093872 1
  131.387622 722.770264 1
  132.042782 2065.352051 3
  132.044502 744.721191 1
  132.046509 1171.003906 2
  132.049089 14896.215820 23
  132.050809 910.015869 1
  133.049825 1013.542236 2
  134.046731 1969.494263 3
  134.810876 780.653442 1
  135.629607 801.392090 1
  136.950451 845.298462 1
  137.058309 777.290771 1
  139.006578 2419.206299 4
  139.483717 885.645020 1
  140.830769 756.734741 1
  141.967049 731.209839 1
  143.228477 706.287598 1
  146.098447 781.298584 1
  146.762633 765.747314 1
  147.314070 837.938110 1
  148.754483 759.699219 1
  148.952117 1114.290527 2
  150.732602 829.762573 1
  151.433957 746.719482 1
  151.946469 5769.027832 9
  153.027958 1104.163940 2
  154.061767 1028.703735 2
  154.918304 823.225708 1
  155.003585 1466.016479 2
  155.718106 884.385742 1
  155.977618 1237.051025 2
  156.688516 872.666504 1
  157.651195 760.886841 1
  161.904878 2047.123169 3
  162.495765 758.217896 1
  162.938894 828.836548 1
  163.233219 786.008667 1
  164.977997 5053.922852 8
  165.825185 772.515869 1
  167.022582 8855.560547 14
  168.956771 763.024048 1
  168.962165 1039.826172 2
  169.019442 1836.157104 3
  169.826050 694.187500 1
  171.827156 899.063599 1
  171.933590 1628.510742 3
  172.030318 2857.851807 4
  173.014571 1615.786621 3
  173.971740 1200.557983 2
  175.009462 1320.402954 2
  176.396384 822.971069 1
  177.520239 837.891602 1
  178.391237 862.497314 1
  179.287709 768.291382 1
  184.030032 924.253052 1
  184.361116 2389.985352 4
  185.972503 2692.932861 4
  186.980408 9020.772461 14
  187.436762 808.537109 1
  187.769308 806.402588 1
  190.977360 955.551270 1
  191.976520 1071.852661 2
  192.968348 1379.520142 2
  192.972906 20194.925781 31
  193.020522 701.511597 1
  193.972475 1443.517456 2
  194.040887 2338.440430 4
  196.690005 803.437500 1
  197.947318 940.559814 1
  198.943948 8287.363281 13
  199.033043 1695.202759 3
  199.380979 768.187744 1
  200.981992 2050.160400 3
  201.008911 9286.489258 14
  202.975006 1249.522095 2
  210.983281 6448.229004 10
  214.997675 1223.515625 2
  218.724437 800.356079 1
  220.941287 3188.511963 5
  226.030997 1137.903809 2
  228.019542 10197.816406 16
  230.970000 8668.699219 13
  238.978097 6366.809082 10
  239.982144 972.989136 2
  242.008603 5446.644043 8
  245.037688 2736.114502 4
  245.045660 2155.682861 3
  246.935000 1408.230103 2
  247.014196 1347.715210 2
  250.941221 1309.742676 2
  250.993802 1142.216919 2
  253.644819 859.753418 1
  255.467963 762.635010 1
  255.985619 1583.838135 2
  257.345150 816.792847 1
  257.555089 836.385742 1
  257.730887 890.083252 1
  257.981220 29872.128906 46
  257.984351 1044.736084 2
  258.177046 852.348877 1
  258.984633 1020.095459 2
  263.085615 1031.207397 2
  263.092064 3698.182373 6
  263.099321 189243.453125 294
  263.105771 5305.319336 8
  263.112222 1520.047852 2
  263.993330 1215.170654 2
  264.096279 2400.450439 4
  264.101955 12863.261719 20
  264.993748 967.126709 2
  265.989209 6594.906250 10
  266.986993 764.134888 1
  268.415282 892.681885 1
  269.107037 4776.504395 7
  270.025161 1886.028931 3
  272.020447 27143.597656 42
  273.014035 815.792236 1
  273.023410 1266.265015 2
  280.396255 772.217896 1
  282.931725 1488.959473 2
  285.068404 1514.956665 2
  285.072951 1394.611694 2
  285.081135 80118.601563 125
  285.088410 1688.132324 3
  286.084112 4642.779785 7
  287.049202 1544.900879 2
  287.056553 72482.609375 113
  287.084121 1014.415405 2
  288.059822 4595.098145 7
  289.783735 1001.891846 2
  300.544455 857.402344 1
  301.045147 5925.617676 9
  301.054029 3405.887207 5
  307.015083 1428.858643 2
  307.062857 2339.489502 4
  307.805289 1097.833618 2
  312.015812 3074.530518 5
  314.939281 854.592773 1
  315.022718 3065.291748 5
  316.009564 20239.275391 31
  316.020178 1987.714966 3
  317.011719 2394.688965 4
  317.018118 107881.242188 168
  317.026649 2637.125488 4
  318.016506 1294.077637 2
  318.021863 6199.901855 10
  319.018541 4432.058105 7
  321.637606 788.179443 1
  323.030536 7498.573242 12
  324.029932 5251.364258 8
  325.015152 1566.850220 2
  325.026223 79804.914063 124
  325.033972 1752.393433 3
  326.029340 6476.286133 10
  326.946620 839.611572 1
  327.022583 5931.190430 9
  329.014842 853.328979 1
  329.579328 782.655029 1
  329.942494 743.159790 1
  331.073157 1338.343506 2
  333.062406 4541.428711 7
  335.501122 1053.996704 2
  337.021412 1233.897949 2
  337.051807 902.933716 1
  339.408110 816.055908 1
  342.086663 2823.645752 4
  343.785623 838.249634 1
  346.054849 1558.374146 2
  346.350585 887.536865 1
  346.555266 815.302979 1
  347.050661 7109.622559 11
  348.829859 883.675049 1
  352.993975 4948.458008 8
  353.067914 1152.577148 2
  354.990927 2783.243164 4
  359.665349 838.347046 1
  363.022520 4726.246094 7
  371.031211 3276.496826 5
  378.968954 1693.522339 3
  380.013688 1124.262695 2
  383.043604 1737.408813 3
  383.575292 960.272949 1
  386.323568 922.274292 1
  388.068181 786.627075 1
  402.009540 1129.990479 2
  406.098869 977.971436 2
  407.655660 849.130493 1
  408.010441 2490.083252 4
  409.886935 740.245239 1
  413.210423 830.795044 1
  417.121196 6758.010254 11
  419.109592 31820.179688 49
  419.117697 991.654785 2
  419.122561 861.825806 1
  420.113193 2003.995483 3
  426.021747 6478.588867 10
  426.059960 848.347290 1
  428.134447 12288.316406 19
  429.011125 832.903320 1
  429.016162 780.210205 1
  429.137065 1362.299438 2
  429.999979 1031.260010 2
  430.129725 1041.697754 2
  433.099504 30543.542969 48
  433.106316 1355.119873 2
  433.113127 923.815552 1
  433.288585 819.986816 1
  434.102533 2359.637939 4
  439.116435 11029.867188 17
  442.150074 936.445679 1
  444.069162 1228.856567 2
  447.075767 3861.752930 6
  448.063253 21281.925781 33
  448.074005 3209.138428 5
  449.070196 79388.617188 123
  449.086378 1679.595337 3
  450.075125 10142.241211 16
  450.170750 834.224609 1
  451.070762 3347.380127 5
  453.066508 1854.474731 3
  455.082865 2521.992188 4
  455.090201 1270.125000 2
  456.082293 2227.483887 3
  457.079478 39029.585938 61
  458.083642 3357.497803 5
  459.076251 2369.356934 4
  464.999812 2075.799072 3
  465.115395 3830.912109 6
  467.728397 821.057617 1
  470.045634 1056.203003 2
  471.052288 2771.812012 4
  480.430587 820.288452 1
  481.175532 848.499390 1
  496.560815 1038.695801 2
  500.106444 771.091431 1
  508.814119 993.809570 2
  515.842333 995.754883 2
  517.059686 1341.557617 2
  518.892695 1377.635132 2
  524.968330 1095.185181 2
  529.181709 3238.301514 5
  531.040306 1550.459595 2
  539.763227 746.766235 1
  542.691602 734.589111 1
  544.648305 856.001221 1
  548.994367 987.141724 2
  551.163706 29480.093750 46
  552.167393 4862.927246 8
  553.168908 1183.129761 2
  557.528013 909.048584 1
  558.898464 1501.488403 2
  560.251424 769.748535 1
  563.386234 790.579834 1
  570.748949 747.245605 1
  571.540645 1128.495239 2
  571.961662 785.022827 1
  573.144541 2222.865234 3
  580.116172 15764.052734 25
  581.120604 1552.046509 2
  587.132452 5262.680664 8
  591.128060 910.454468 1
  594.153646 1007.587646 2
  601.112155 819.086304 1
  602.099052 1728.743774 3
  603.105171 12044.699219 19
  604.111008 1804.949829 3
  605.105302 1221.088623 2
  611.114382 4934.195801 8
  611.142925 1165.492554 2
  619.080438 1592.657104 2
  620.018584 2076.706299 3
  624.706057 817.083862 1
  628.585515 854.304443 1
  632.810887 966.614136 2
  633.726171 830.462036 1
  643.050883 1501.113892 2
  648.838504 744.713989 1
  651.048636 808.083862 1
  655.813758 996.926270 2
  661.067896 909.973877 1
  661.234911 1614.915161 3
  670.292831 893.354980 1
  671.096828 1122.193359 2
  671.126390 1313.779785 2
  673.081817 917.688354 1
  675.924765 1061.702637 2
  683.217707 1043.158936 2
  691.044417 910.495361 1
  696.999571 1092.076904 2
  703.655808 961.095337 1
  705.199415 1984.593872 3
  710.855233 735.086792 1
  721.174937 838.561523 1
  724.155247 807.425049 1
  734.150264 1506.551392 2
  740.600162 744.025146 1
  742.068353 1223.306396 2
  749.347301 762.607056 1
  751.121540 1851.063354 3
  757.143064 3487.590088 5
  759.130772 1466.853516 2
  766.089645 1472.955688 2
  766.105670 1356.453491 2
  767.096164 3459.085938 5
  768.100645 1309.625854 2
  769.099041 969.464111 2
  773.120278 1029.979370 2
  775.106038 3291.934082 5
  782.902545 782.208130 1
  782.914961 737.044922 1
  791.313302 1839.709595 3
  793.961018 927.791260 1
  804.754896 869.439209 1
  805.091429 801.972656 1
  808.116724 9258.884766 14
  809.120249 2719.952637 4
  839.115103 882.826660 1
  844.161764 764.881958 1
  851.404364 908.414673 1
  856.320965 831.084229 1
  857.339747 980.387207 2
  861.027232 1426.863770 2
  869.190019 1542.848267 2
  877.199408 1396.450684 2
  877.626603 959.563599 1
  889.635697 918.300781 1
  898.637040 1119.424561 2
  899.844474 844.930908 1
  902.763535 903.505737 1
  905.974967 3580.074951 6
  906.145007 1191.774536 2
  910.671154 955.494995 1
  918.446440 1087.625244 2
  919.035702 895.712036 1
  920.727715 821.669434 1
  921.129000 1235.406616 2
  921.181821 969.376099 2
  921.324458 1094.551758 2
  926.742669 870.884155 1
  936.623129 929.604248 1
  1005.969235 12553.189453 20
  1006.976678 2501.825439 4
  1010.620887 799.251953 1
  1017.343296 998.907959 2
  1032.794528 1115.290405 2
  1036.491645 917.579956 1
  1044.487567 949.363892 1
  1050.270423 890.807373 1
  1055.414443 1386.671631 2
  1065.757347 854.659790 1
  1065.987452 1079.468262 2
  1086.633789 1107.696655 2
  1097.749306 727.900513 1
  1104.368926 1018.479126 2
  1105.965432 16794.720703 26
  1106.966746 5207.482910 8
  1114.527170 887.107422 1
  1118.834764 783.635010 1
  1146.253071 920.325317 1
  1149.162063 820.645264 1
  1165.985321 12565.942383 20
  1166.986407 3183.221436 5
  1167.988784 1483.699707 2
  1182.389145 877.935913 1
  1182.973150 1521.690674 2
  1205.956640 11258.053711 18
  1206.962121 2582.041260 4
  1207.960927 858.835693 1
  1208.056116 848.238037 1
  1233.969956 1876.080688 3
  1249.770238 917.435059 1
  1251.658867 1036.024048 2
  1255.230507 977.328125 2
  1255.944988 2702.414795 4
  1256.954705 1124.573853 2
  1257.948782 1188.938477 2
  1262.826671 811.071167 1
  1265.978062 29946.300781 47
  1266.982865 9512.605469 15
  1275.055924 812.710327 1
  1276.485040 805.871948 1
  1280.544392 745.796509 1
  1282.971940 3185.510742 5
  1283.884050 926.844727 1
  1284.066589 922.829834 1
  1294.747220 964.707275 2
  1305.953902 1661.158081 3
  1306.953119 1135.025635 2
  1333.966349 6670.083496 10
  1334.961032 1113.488770 2
  1341.425828 990.830200 2
  1352.023508 1778.172729 3
  1354.487684 871.478760 1
  1355.939238 1410.561890 2
  1365.974981 26047.173828 41
  1366.977040 8481.906250 13
  1374.060919 1068.525513 2
  1382.957032 2886.499512 4
  1385.165339 913.578125 1
  1388.297140 881.796631 1
  1396.967029 842.174438 1
  1428.250567 1148.546143 2
  1433.958002 4278.041016 7
  1434.963914 1271.651978 2
  1439.029106 897.412842 1
  1452.018552 1431.988892 2
  1456.355969 988.828247 2
  1465.152882 1064.235352 2
  1465.969084 11053.694336 17
  1466.966411 4624.769043 7
  1467.964756 954.235474 1
  1482.955151 2203.155762 3