ACCESSION: MSBNK-NAIST-KNA00760
RECORD_TITLE: L-(-)-Phenylalanine; LC-ESI-ITFT; MS; NEG
DATE: 2016.01.19 (Created 2009.11.19, modified 2011.08.03)
AUTHORS: Takahashi H, Kanaya S, Ogasawara N, Graduate School of Information Science, NAIST
LICENSE: CC BY-SA
COMMENT: [Spectral] L-Phenylalanine (exact mass = 165.07898) and NADP+ (exact mass = 743.07545) were not completely separated on HPLC under the present analytical conditions as described in "AC$XXX". Additionally some of the peaks in this data contains dimers and other unidentified ions.

CH$NAME: L-Phenylalanine
CH$NAME: (S)-alpha-Amino-beta-phenylpropionic acid
CH$NAME: L-(-)-Phenylalanine
CH$COMPOUND_CLASS: Natural Product
CH$FORMULA: C9H11NO2
CH$EXACT_MASS: 165.07898
CH$SMILES: C1=CC=C(C=C1)C[C@@H](C(=O)O)N
CH$IUPAC: InChI=1S/C9H11NO2/c10-8(9(11)12)6-7-4-2-1-3-5-7/h1-5,8H,6,10H2,(H,11,12)/t8-/m0/s1
CH$LINK: CAS 63-91-2
CH$LINK: CHEBI 17295
CH$LINK: KEGG C00079
CH$LINK: KNAPSACK C00001386
CH$LINK: NIKKAJI J9.175H
CH$LINK: PUBCHEM CID:6140
CH$LINK: INCHIKEY COLNVLDHVKWLRT-QMMMGPOBSA-N
CH$LINK: COMPTOX DTXSID4040763

AC$INSTRUMENT: LTQ Orbitrap XL, Thermo Scientfic
AC$INSTRUMENT_TYPE: LC-ESI-ITFT
AC$MASS_SPECTROMETRY: MS_TYPE MS
AC$MASS_SPECTROMETRY: ION_MODE NEGATIVE
AC$MASS_SPECTROMETRY: COLLISION_ENERGY 35eV
AC$MASS_SPECTROMETRY: IONIZATION ESI
AC$CHROMATOGRAPHY: COLUMN_NAME TOSOH TSKgel ODS-100V 5um Part no. 21456
AC$CHROMATOGRAPHY: FLOW_GRADIENT 0min:3%, 45min:97%, 50min:97%, 50.1:3%, 57min:3% (acetonitrile)
AC$CHROMATOGRAPHY: FLOW_RATE 0.5 ml/min
AC$CHROMATOGRAPHY: RETENTION_TIME 11.719385 min
AC$CHROMATOGRAPHY: SOLVENT A 0.1%formate-water
AC$CHROMATOGRAPHY: SOLVENT B 0.1%formate-acetonitrile

MS$FOCUSED_ION: BASE_PEAK 742.066711

PK$SPLASH: splash10-0ir3-0988735721-51af246c5e307624d6a4
PK$NUM_PEAK: 594
PK$PEAK: m/z int. rel.int.
  101.098556 868.342773 5
  103.920296 2282.510010 13
  104.712785 930.420166 5
  105.225013 770.419312 4
  105.703631 746.876099 4
  107.097652 796.829956 5
  110.619018 741.532349 4
  112.981564 1865.441650 11
  112.983606 2393.753174 14
  112.985421 86762.148438 494
  112.987690 2308.924805 13
  112.989278 1146.144653 7
  113.293727 774.401733 4
  113.988828 1034.178833 6
  114.223488 824.871094 5
  114.951622 6472.899902 37
  116.050569 1349.918579 8
  119.282271 795.658936 5
  119.511749 760.561890 4
  121.946133 847.277954 5
  122.588017 791.244751 5
  123.599969 818.763794 5
  124.312825 694.161987 4
  125.969517 860.033447 5
  127.262613 911.784058 5
  128.021664 900.874878 5
  128.549558 786.777954 4
  130.413143 955.680664 5
  131.563925 749.620483 4
  133.510006 1125.255127 6
  134.046731 6338.455566 36
  136.872061 706.984497 4
  137.756700 650.345581 4
  137.757616 675.602295 4
  138.979953 1050.951660 6
  139.006887 1967.199951 11
  142.946173 5129.927246 29
  143.034687 3060.002930 17
  146.965735 4869.164551 28
  146.967418 890.501465 5
  147.044870 13774.162109 78
  148.047813 1062.883057 6
  149.427566 811.588623 5
  152.977899 859.990479 5
  153.003283 861.336548 5
  154.973328 2223.731689 13
  155.034581 1160.786255 7
  158.924781 3311.312744 19
  160.841743 8512.072266 48
  162.055610 895.510376 5
  162.786143 872.909790 5
  162.838737 8452.265625 48
  164.061428 754.666626 4
  164.064604 2946.564453 17
  164.068178 4728.445801 27
  164.071354 169486.609375 965
  164.074133 3482.093018 20
  164.074928 3540.139160 20
  164.077707 2508.379883 14
  164.835565 2727.344727 16
  164.927965 856.119019 5
  165.071319 881.302002 5
  165.074524 12772.271484 73
  166.618355 720.546265 4
  166.933713 1339.373413 8
  167.042974 881.008423 5
  168.961750 1426.767456 8
  170.018971 886.216064 5
  170.943754 1543.336548 9
  172.940642 1067.109253 6
  174.150058 957.739380 5
  174.917641 1257.628662 7
  174.979722 1941.109863 11
  175.670954 886.785645 5
  175.683271 848.474487 5
  176.172187 853.628174 5
  176.935406 1164.578125 7
  177.027930 804.830322 5
  180.381211 712.361938 4
  184.367738 1462.927979 8
  187.860244 1070.074097 6
  188.556851 792.675659 5
  189.363144 916.807007 5
  191.358381 805.591797 5
  192.927839 1209.161499 7
  194.337416 868.907471 5
  195.727314 904.523071 5
  197.044877 1961.612549 11
  197.962578 10981.224609 63
  198.588166 959.729004 5
  200.047517 3498.941162 20
  200.681948 799.646240 5
  201.412798 768.660767 4
  202.504876 792.688721 5
  202.523933 831.787720 5
  202.988119 4500.004883 26
  204.051743 1000.666504 6
  204.271648 878.916748 5
  204.743519 910.300903 5
  206.604802 787.088013 4
  211.000652 1820.604248 10
  213.047362 811.567749 5
  213.998188 1430.295654 8
  214.240889 986.913208 6
  215.055460 2085.046143 12
  216.992404 891.540161 5
  217.990465 2195.874268 13
  219.649587 838.022217 5
  220.006123 10748.294922 61
  221.071642 783.997437 4
  222.020490 1508.428955 9
  222.024240 1149.716431 7
  222.029240 23357.552734 133
  223.032714 2424.777832 14
  224.026535 7136.543457 41
  226.977741 2277.308594 13
  227.088906 805.329590 5
  228.839449 851.540039 5
  232.058139 36605.871094 208
  233.061864 3016.427490 17
  235.726302 898.983032 5
  240.338646 772.960571 4
  242.269147 822.396729 5
  244.003221 1103.239746 6
  244.008262 5814.616211 33
  244.615741 765.940186 4
  248.959787 33179.863281 189
  249.048127 25511.699219 145
  249.569473 810.951050 5
  250.051366 1545.974731 9
  250.987792 1474.908447 8
  253.003419 1417.804932 8
  253.966433 10498.699219 60
  254.967259 796.157104 5
  255.963180 2086.920166 12
  257.992963 826.028320 5
  260.053324 994.119751 6
  260.590550 872.201172 5
  261.044955 1129.240479 6
  262.019029 5897.578613 34
  262.053489 2545.947021 14
  263.995761 9929.857422 57
  265.204142 785.111938 4
  266.011339 1442.097168 8
  272.003495 7622.698730 43
  272.956090 7478.736816 43
  273.007217 936.754028 5
  274.841054 968.483276 6
  276.084008 1727.153809 10
  278.051447 1004.773315 6
  278.060207 5255.410645 30
  279.985105 1718.843506 10
  280.039991 7033.444824 40
  282.006097 2080.515137 12
  283.999311 1097.042603 6
  287.075850 1394.893188 8
  287.117208 877.245850 5
  287.948088 1061.400024 6
  288.020107 1111.936401 6
  288.516667 765.539917 4
  289.943171 40494.148438 231
  289.947835 1330.700806 8
  290.014074 7815.307617 44
  290.946623 2992.435547 17
  290.966314 1690.822998 10
  291.006639 4596.087402 26
  291.016018 792.372681 5
  291.940213 20997.025391 120
  292.943638 1890.759277 11
  293.937012 3010.800293 17
  293.964625 770.300659 4
  294.028435 6587.685547 38
  294.042723 6057.574707 34
  297.421921 869.805420 5
  297.938144 3016.455078 17
  299.934084 2022.088867 12
  299.972361 6719.262695 38
  300.045993 7989.355957 45
  301.968982 1482.220337 8
  303.931538 1049.630859 6
  303.962574 1275.416748 7
  307.979830 1081.318848 6
  308.022722 1151.410400 7
  309.016856 1216.545288 7
  310.001373 8737.519531 50
  311.005109 1427.260010 8
  315.957565 936.884766 5
  316.029731 2368.104980 13
  317.012786 1300.955566 7
  318.009006 5787.141113 33
  321.985538 3498.225586 20
  324.397208 965.110107 5
  326.067159 1082.053467 6
  329.150186 10038.095703 57
  330.153202 1791.564697 10
  334.086832 945.952393 5
  338.054779 1331.542114 8
  338.987934 2993.049805 17
  340.472658 860.685669 5
  346.054849 1457.269775 8
  349.410335 831.414307 5
  351.110760 1287.413452 7
  351.121947 2095.511963 12
  351.131892 110094.273438 627
  351.143080 1422.584229 8
  351.151782 1126.437378 6
  352.128491 822.901245 5
  352.134733 13727.091797 78
  353.092984 1142.759277 7
  353.097998 1279.422485 7
  353.108026 85579.640625 487
  353.119309 1172.795898 7
  354.110539 17382.707031 99
  355.114797 1214.812134 7
  355.879677 848.525635 5
  357.007421 944.893799 5
  357.087724 1974.670654 11
  359.327949 781.248413 4
  360.969175 1806.833740 10
  367.959668 1234.249146 7
  367.990341 1030.572021 6
  368.033023 1780.427490 10
  369.957389 1067.281250 6
  376.153881 781.633789 4
  376.729301 847.098877 5
  377.950732 792.362183 5
  383.069100 16678.492188 95
  384.076801 22265.888672 127
  385.068496 1004.772095 6
  385.079917 5176.340820 29
  387.064883 884.486816 5
  387.460836 816.916748 5
  388.886961 866.250854 5
  389.081185 1697.295776 10
  390.080694 2086.328125 12
  391.076753 28597.650391 163
  392.081032 4066.204590 23
  393.074461 2587.014893 15
  394.527279 9554.496094 54
  396.761966 1024.483032 6
  397.123550 2166.591797 12
  399.098529 970.468628 6
  399.113593 14297.740234 81
  399.804430 809.780273 5
  400.115741 3321.569092 19
  401.079174 8527.691406 49
  402.082646 2657.795410 15
  407.240780 799.928955 5
  408.010441 20207.804688 115
  409.013485 2191.964111 12
  413.102533 9684.162109 55
  414.105319 1552.067261 9
  415.533928 2172.319092 12
  417.050386 4448.528809 25
  418.048210 1605.734863 9
  418.471632 906.191162 5
  419.031793 1506.804565 9
  419.044758 70000.492188 399
  419.077173 1234.500000 7
  419.119318 6511.397949 37
  420.049753 11187.464844 64
  420.082285 731.810669 4
  420.122955 1281.967407 7
  421.042043 16592.576172 94
  421.050205 1493.391479 9
  421.488005 887.339478 5
  422.046045 2883.254150 16
  423.042134 840.774658 5
  425.991845 1200.364624 7
  426.021747 13326.742188 76
  427.023617 1711.073364 10
  427.040289 2973.166016 17
  427.053627 1186.697388 7
  427.078639 1534.494873 9
  428.067508 3733.746094 21
  429.036309 2513.016602 14
  429.063173 928.363159 5
  429.074928 52416.253906 298
  430.077482 9018.578125 51
  431.036209 925.685425 5
  431.075099 1454.882690 8
  431.310237 726.897705 4
  437.082547 17378.126953 99
  437.902020 818.831299 5
  438.085594 2680.049561 15
  441.063032 845.349976 5
  442.127240 792.081421 5
  443.138900 3782.229004 22
  444.141658 2063.899658 12
  445.119434 4827.298828 27
  445.975859 1940.946045 11
  446.064842 1968.294922 11
  446.121804 1282.056763 7
  448.002335 1825.872803 10
  449.979529 1194.391235 7
  452.066075 923.605835 5
  460.751488 858.811890 5
  463.097959 1865.041992 11
  467.100264 1336.003052 8
  467.984595 814.166870 5
  472.935384 876.125000 5
  481.087802 1982.850342 11
  484.964712 1779.418701 10
  485.136266 852.015381 5
  487.033447 2062.969971 12
  487.065939 1717.020752 10
  487.106559 2711.910156 15
  487.977049 2268.714844 13
  492.639333 778.655396 4
  495.065279 1180.146851 7
  497.060833 8327.439453 47
  498.065238 1035.394531 6
  499.935337 1016.346436 6
  503.018101 833.937378 5
  503.150277 2411.566650 14
  505.070559 2081.858154 12
  505.948809 1006.820435 6
  505.987513 1471.295044 8
  506.073538 992.086060 6
  507.945703 871.526367 5
  509.665199 842.950317 5
  513.106331 1021.441650 6
  518.187740 19490.976563 111
  519.189831 5007.220215 29
  520.031237 720.221313 4
  526.564973 912.661377 5
  529.759455 861.072266 5
  532.175013 3644.245361 21
  533.178426 1896.449463 11
  538.193496 3866.047852 22
  538.878228 856.243286 5
  539.195063 901.646362 5
  540.052389 5370.117676 31
  541.056774 1339.494629 8
  546.152325 1858.038574 11
  547.139930 15813.289063 90
  547.152020 1223.284912 7
  548.125367 1074.785889 6
  548.147188 53919.804688 307
  548.159312 1692.189331 10
  549.152368 13450.205078 77
  550.148126 2177.157471 12
  554.160827 1505.546997 9
  555.021991 1381.839844 8
  555.093639 1782.098145 10
  555.160359 1624.893677 9
  556.142774 1021.688843 6
  556.155163 13658.894531 78
  557.160098 3667.303467 21
  558.152811 885.249390 5
  558.162777 1068.313965 6
  561.043967 738.422119 4
  564.193036 21705.013672 124
  565.049785 2596.453857 15
  565.194459 5400.315430 31
  566.198549 1127.737793 6
  573.053819 1104.278564 6
  573.292335 886.234619 5
  584.234967 953.082520 5
  593.145270 2984.694580 17
  600.163793 1309.173096 7
  602.006951 2209.160400 13
  603.466310 812.760254 5
  606.104873 1291.257080 7
  606.180998 1721.184570 10
  613.051268 908.575195 5
  615.127063 990.116333 6
  616.134242 7172.364746 41
  616.304754 954.815918 5
  617.138103 1730.459961 10
  618.135709 1133.775513 6
  619.969002 3812.671387 22
  619.992334 1185.457153 7
  620.018584 131801.515625 750
  620.039003 1458.123779 8
  620.044837 1636.257446 9
  620.065256 1213.325562 7
  620.879939 969.662598 6
  621.023186 19779.107422 113
  622.024369 3158.169434 18
  624.087028 1140.667358 6
  624.142998 1948.324219 11
  632.179775 2781.791992 16
  634.045784 925.203613 5
  636.368704 1184.838867 7
  638.030973 10619.208984 60
  639.030852 1557.177612 9
  641.955506 1048.956787 6
  642.001603 3874.732910 22
  647.952615 1025.231689 6
  649.826348 1122.812012 6
  652.044679 1155.174683 7
  652.557731 885.680664 5
  655.966089 792.130981 5
  673.910669 854.743896 5
  674.092495 1678.358154 10
  674.168553 2434.322021 14
  674.337249 1354.633423 8
  676.170517 986.883667 6
  678.779081 825.193726 5
  682.247043 978.027466 6
  683.264945 28688.037109 163
  684.122825 5254.402344 30
  684.268217 11584.529297 66
  685.124601 2315.918701 13
  686.142160 920.544800 5
  690.139233 887.613037 5
  692.130238 1471.497192 8
  702.275463 897.802002 5
  710.096724 18777.751953 107
  711.102368 3278.914063 19
  712.106560 940.442017 5
  712.217870 12981.912109 74
  713.220828 5435.082520 31
  720.027384 826.944824 5
  735.207455 1893.807373 11
  739.049012 946.218262 5
  742.033982 1892.714844 11
  742.068353 175466.234375 999
  742.091268 1336.166626 8
  742.102727 2343.587402 13
  742.125644 1761.602539 10
  742.152381 1649.552979 9
  743.069983 33562.875000 191
  744.073643 6638.090820 38
  752.110385 4637.308594 26
  752.328661 898.435059 5
  753.112899 1815.193604 10
  757.131256 843.405029 5
  760.115684 938.868530 5
  764.046631 9405.894531 54
  765.049124 2839.084229 16
  766.105670 3003.961670 17
  766.859393 726.026367 4
  778.488764 952.528809 5
  781.064074 1446.024414 8
  788.227069 1355.947021 8
  790.019579 1442.718994 8
  790.065728 59767.277344 340
  791.065232 13644.681641 78
  792.058211 1427.146729 8
  792.075057 2525.522949 14
  793.061500 1081.484619 6
  797.174566 1089.504150 6
  798.856910 947.024536 5
  801.525460 997.015015 6
  803.195799 3592.858887 20
  804.198786 978.155762 6
  808.073323 18800.929688 107
  808.116724 4634.549805 26
  809.076768 4711.750488 27
  810.064658 1118.072876 6
  812.045875 6938.742676 40
  813.148719 1846.577393 11
  819.015534 3524.929932 20
  820.026126 1357.389771 8
  821.091928 1097.588501 6
  824.843122 898.548462 5
  831.942275 940.609741 5
  832.073764 9695.994141 55
  833.076827 2324.496826 13
  840.720126 910.944214 5
  850.086997 1834.223877 10
  854.057731 1244.229248 7
  855.209487 1381.028442 8
  858.921268 911.211914 5
  861.027232 3111.167969 18
  862.030518 1109.736816 6
  865.964952 1270.928711 7
  871.110399 933.709106 5
  871.178407 2238.287842 13
  872.189761 874.339233 5
  876.066644 18965.011719 108
  877.066894 7289.322754 42
  881.144369 1206.532104 7
  886.052061 1740.093750 10
  890.082044 1461.874390 8
  895.859525 913.755005 5
  897.137510 764.786987 4
  897.152740 779.604004 4
  905.980119 4102.005371 23
  906.985602 1206.577393 7
  917.358848 899.439697 5
  923.409681 1043.649780 6
  927.953799 871.822021 5
  930.962516 1078.318237 6
  931.214797 815.914551 5
  933.225973 1080.967041 6
  939.119292 958.931396 5
  945.183893 797.088013 5
  955.143994 28080.455078 160
  956.148654 6964.741211 40
  958.134719 910.449707 5
  959.076760 861.554688 5
  959.245128 779.673828 4
  961.060702 1850.579102 11
  962.069076 932.973145 5
  969.075444 1044.380127 6
  977.127383 2070.662842 12
  978.126478 1039.605835 6
  990.259650 1159.818604 7
  991.054929 1060.079956 6
  997.154281 1332.383911 8
  1000.213141 1058.046265 6
  1001.211947 1042.885498 6
  1005.969235 13254.367188 75
  1006.976678 2782.743408 16
  1007.115546 1135.970825 6
  1008.082381 1082.801880 6
  1023.130625 1595.345581 9
  1026.104922 1874.281494 11
  1039.081326 850.809937 5
  1039.169926 905.299561 5
  1041.141024 2693.421387 15
  1042.138212 947.909790 5
  1043.149563 1126.911865 6
  1048.215646 926.660522 5
  1048.286179 1073.015137 6
  1048.337480 904.483398 5
  1063.126305 2977.299561 17
  1064.122460 1422.750610 8
  1065.126583 999.104858 6
  1065.994028 1198.535645 7
  1068.200260 1170.949463 7
  1071.969922 858.412720 5
  1075.079951 872.352417 5
  1105.965432 20762.152344 118
  1106.966746 4282.654297 24
  1133.298325 940.982178 5
  1137.976360 838.685425 5
  1142.201920 2538.126221 14
  1143.201738 1002.600342 6
  1149.449153 865.077271 5
  1155.955800 860.668701 5
  1165.985321 12209.705078 70
  1166.271214 1061.869995 6
  1166.986407 2898.700928 17
  1169.256791 822.167114 5
  1170.073029 1003.318604 6
  1178.320840 1402.884644 8
  1194.362477 1065.472412 6
  1200.146413 974.893921 6
  1203.689036 1013.223877 6
  1204.115204 1471.513550 8
  1205.157903 1133.147583 6
  1205.877522 894.058838 5
  1205.956640 11466.074219 65
  1206.962121 2024.867432 12
  1208.548106 851.458130 5
  1217.222850 938.031616 5
  1231.794428 812.896362 5
  1233.978145 4765.125488 27
  1236.750890 996.729004 6
  1255.953397 2695.494141 15
  1256.727412 805.747070 5
  1257.872921 818.402588 5
  1265.152976 1150.524170 7
  1265.978062 39019.843750 222
  1266.097214 779.822754 4
  1266.982865 12147.148438 69
  1267.971803 1163.068115 7
  1270.030112 931.611450 5
  1274.230541 924.113037 5
  1274.445407 894.464478 5
  1282.971940 1050.781494 6
  1291.777284 1030.357178 6
  1295.064148 1091.256958 6
  1305.944986 2069.566650 12
  1312.568188 797.849609 5
  1315.907719 880.251221 5
  1317.378983 858.687988 5
  1321.117852 929.799194 5
  1326.641949 988.001587 6
  1333.966349 10071.578125 57
  1334.961032 2393.525146 14
  1340.219956 905.586304 5
  1362.975407 940.721069 5
  1365.974981 24567.488281 140
  1366.977040 9042.246094 51
  1375.216405 936.381226 5
  1382.966749 1012.918335 6
  1389.059742 996.094849 6
  1433.958002 8882.537109 51
  1434.963914 2148.304688 12
  1442.024684 952.337769 5
  1443.070168 1078.894897 6
  1465.969084 15771.800781 90
  1466.966411 4216.221191 24
  1470.997890 1100.076538 6
  1474.232911 1012.576416 6
  1478.509195 825.051758 5
  1485.537159 1477.946533 8
  1487.746386 1301.302246 7
  1489.297951 782.718750 4