ACCESSION: MSBNK-Keio_Univ-KO003958
RECORD_TITLE: Ribostamycin; LC-ESI-QQ; MS2; CE:20 V; [M+H]+
DATE: 2016.01.19 (Created 2007.07.07, modified 2011.05.10)
AUTHORS: Kakazu Y, Horai H, Institute for Advanced Biosciences, Keio Univ.
LICENSE: CC BY-NC-SA
COMMENT: KEIO_ID R016

CH$NAME: Ribostamycin
CH$NAME: Vistamycin
CH$COMPOUND_CLASS: N/A
CH$FORMULA: C17H34N4O10
CH$EXACT_MASS: 454.22749
CH$SMILES: NC[C@@H](O1)[C@@H](O)[C@H](O)[C@@H](N)[C@H]1O[C@H]([C@@H](N)2)[C@H](O[C@H](O3)[C@H](O)[C@H](O)[C@@H](CO)3)[C@@H](O)[C@H](N)C2
CH$IUPAC: InChI=1S/C17H34N4O10/c18-2-6-10(24)12(26)8(21)16(28-6)30-14-5(20)1-4(19)9(23)15(14)31-17-13(27)11(25)7(3-22)29-17/h4-17,22-27H,1-3,18-21H2/t4-,5+,6-,7-,8-,9+,10-,11-,12-,13-,14-,15-,16-,17-/m1/s1
CH$LINK: CAS 25546-65-0
CH$LINK: CHEBI 10003
CH$LINK: KEGG C01759
CH$LINK: NIKKAJI J20.066B
CH$LINK: PUBCHEM SID:4892
CH$LINK: INCHIKEY NSKGQURZWSPSBC-DLBSIDPUSA-N

AC$INSTRUMENT: API3000, Applied Biosystems
AC$INSTRUMENT_TYPE: LC-ESI-QQ
AC$MASS_SPECTROMETRY: MS_TYPE MS2
AC$MASS_SPECTROMETRY: ION_MODE POSITIVE
AC$MASS_SPECTROMETRY: COLLISION_ENERGY 20 V

MS$FOCUSED_ION: PRECURSOR_M/Z 455
MS$FOCUSED_ION: PRECURSOR_TYPE [M+H]+

PK$SPLASH: splash10-0a4i-0331900000-7bdb37aed6d6b7bb3371
PK$NUM_PEAK: 20
PK$PEAK: m/z int. rel.int.
  143.100 64356.5 12
  161.100 544555.0 103
  163.300 1331684.5 251
  166.000 24752.5 5
  198.900 19802.0 4
  239.400 306931.0 58
  259.500 19802.0 4
  275.400 29703.0 6
  277.400 34653.5 7
  289.000 227723.0 43
  290.300 84158.5 16
  293.400 79208.0 15
  295.700 1262377.5 238
  308.000 153465.5 29
  323.500 564357.0 107
  333.100 49505.0 9
  379.300 118812.0 22
  419.300 29703.0 6
  438.600 39604.0 7
  455.700 5292084.5 999