ACCESSION: MSBNK-Kazusa-KZ000123
RECORD_TITLE: D-(-)-Ribose; GC-EI-TOF; MS; 4 TMS; BP:103
DATE: 2016.01.19 (Created 2009.03.11, modified 2011.05.06)
AUTHORS: Ara T, Morishita Y, Shibata D, Kazusa DNA Research Institute
LICENSE: CC BY-SA
COMMENT: MassBase peak ID: MDGC1_05556_P000019

CH$NAME: D-(-)-Ribose
CH$COMPOUND_CLASS: Natural Product
CH$FORMULA: C5H10O5
CH$EXACT_MASS: 150.05282
CH$SMILES: OC[C@@H](O1)[C@@H](O)[C@@H](O)C(O)1
CH$IUPAC: InChI=1S/C5H10O5/c6-1-2-3(7)4(8)5(9)10-2/h2-9H,1H2/t2-,3-,4-,5?/m1/s1
CH$LINK: CAS 50-69-1
CH$LINK: KEGG C00121
CH$LINK: INCHIKEY HMFHBZSHGGEWLO-SOOFDHNKSA-N

AC$INSTRUMENT: Pegasus III TOF-MS system, Leco; GC 6890, Agilent Technologies
AC$INSTRUMENT_TYPE: GC-EI-TOF
AC$MASS_SPECTROMETRY: MS_TYPE MS
AC$MASS_SPECTROMETRY: ION_MODE POSITIVE
AC$CHROMATOGRAPHY: COLUMN_NAME DB-17MS
AC$CHROMATOGRAPHY: RETENTION_INDEX 0.0000
AC$CHROMATOGRAPHY: RETENTION_TIME 760.312 sec

MS$FOCUSED_ION: BASE_PEAK 103
MS$FOCUSED_ION: DERIVATIVE_TYPE 4 TMS
MS$DATA_PROCESSING: WHOLE ChromaTOF ver. 2.32 (Leco)

PK$SPLASH: splash10-0udi-0910000000-54f42f17ff952d787b86
PK$NUM_PEAK: 100
PK$PEAK: m/z int. rel.int.
  82 5 5
  83 1 1
  84 1 1
  85 6 6
  86 5 5
  87 5 5
  88 4 4
  89 82 82
  90 6 6
  91 3 3
  99 1 1
  100 15 15
  101 7 7
  102 11 11
  103 999 999
  104 95 95
  105 47 47
  106 2 2
  111 1 1
  112 2 2
  113 4 4
  114 12 12
  115 5 5
  116 6 6
  117 58 58
  118 8 8
  119 10 10
  120 1 1
  126 2 2
  127 2 2
  128 2 2
  129 17 17
  130 7 7
  131 16 16
  132 3 3
  133 52 52
  134 8 8
  135 4 4
  142 2 2
  143 5 5
  144 1 1
  145 8 8
  146 2 2
  147 181 181
  148 36 36
  149 15 15
  150 2 2
  157 2 2
  158 3 3
  159 1 1
  160 75 75
  161 18 18
  162 4 4
  163 6 6
  164 1 1
  173 3 3
  174 10 10
  175 5 5
  176 1 1
  177 1 1
  188 1 1
  189 62 62
  190 14 14
  191 18 18
  192 3 3
  193 1 1
  203 1 1
  204 1 1
  205 25 25
  206 3 3
  207 2 2
  217 136 136
  218 34 34
  219 11 11
  220 2 2
  221 3 3
  222 1 1
  229 1 1
  230 1 1
  231 5 5
  232 2 2
  233 25 25
  234 9 9
  235 3 3
  248 2 2
  262 4 4
  263 1 1
  274 3 3
  275 1 1
  277 20 20
  278 10 10
  279 5 5
  280 2 2
  307 39 39
  308 22 22
  309 14 14
  310 3 3
  319 1 1
  467 1 1
  468 1 1