ACCESSION: MSBNK-CASMI_2016-SM800653
RECORD_TITLE: 2,4-Dibromphenol; LC-ESI-QFT; MS2; CE: 35 NCE; R=35000; [M-H]-
DATE: 2016.12.12
AUTHORS: Krauss M, Schymanski EL, Weidauer C, Schupke H, UFZ and Eawag
LICENSE: CC BY
COPYRIGHT: Copyright (C) 2016 UFZ/Eawag
PUBLICATION: Schymanski, E. L.; Ruttkies, C.; Krauss, M.; Brouard, C.; Kind, T.; Dührkop, K.; Allen, F.; Vaniya, A.; Verdegem, D.; Böcker, S.; et al. Critical Assessment of Small Molecule Identification 2016: Automated Methods. Journal of Cheminformatics 2017, 9 (1). DOI:10.1186/s13321-017-0207-1
COMMENT: CONFIDENCE Reference Standard (Level 1)
COMMENT: INTERNAL_ID 8006

CH$NAME: 2,4-Dibromphenol
CH$COMPOUND_CLASS: N/A; Environmental Standard
CH$FORMULA: C6H4Br2O
CH$EXACT_MASS: 249.86289
CH$SMILES: OC1=C(Br)C=C(Br)C=C1
CH$IUPAC: InChI=1S/C6H4Br2O/c7-4-1-2-6(9)5(8)3-4/h1-3,9H
CH$LINK: CAS 615-58-7
CH$LINK: CHEBI 34238
CH$LINK: KEGG C14521
CH$LINK: PUBCHEM CID:12005
CH$LINK: INCHIKEY FAXWFCTVSHEODL-UHFFFAOYSA-N
CH$LINK: CHEMSPIDER 11510
CH$LINK: COMPTOX DTXSID1052290

AC$INSTRUMENT: Q Exactive Plus Orbitrap Thermo Scientific
AC$INSTRUMENT_TYPE: LC-ESI-QFT
AC$MASS_SPECTROMETRY: MS_TYPE MS2
AC$MASS_SPECTROMETRY: ION_MODE NEGATIVE
AC$MASS_SPECTROMETRY: IONIZATION ESI
AC$MASS_SPECTROMETRY: FRAGMENTATION_MODE HCD
AC$MASS_SPECTROMETRY: COLLISION_ENERGY 35 (nominal)
AC$MASS_SPECTROMETRY: RESOLUTION 35000
AC$CHROMATOGRAPHY: COLUMN_NAME Kinetex C18 EVO 2.6 um, 2.1x50 mm, precolumn 2.1x5 mm, Phenomenex
AC$CHROMATOGRAPHY: FLOW_GRADIENT 95/5 at 0 min, 95/5 at 1 min, 0/100 at 13 min, 0/100 at 24 min
AC$CHROMATOGRAPHY: FLOW_RATE 300 uL/min
AC$CHROMATOGRAPHY: RETENTION_TIME 10.665 min
AC$CHROMATOGRAPHY: SOLVENT A water with 0.1% formic acid
AC$CHROMATOGRAPHY: SOLVENT B methanol with 0.1% formic acid

MS$FOCUSED_ION: BASE_PEAK 91.0021
MS$FOCUSED_ION: PRECURSOR_M/Z 248.8556
MS$FOCUSED_ION: PRECURSOR_TYPE [M-H]-
MS$DATA_PROCESSING: RECALIBRATE loess on assigned fragments and MS1
MS$DATA_PROCESSING: REANALYZE Peaks with additional N2/O included
MS$DATA_PROCESSING: WHOLE RMassBank 2.3.1

PK$SPLASH: splash10-0002-0090000000-b6a35a6269602c894685
PK$ANNOTATION: m/z tentative_formula formula_count mass error(ppm)
  168.9295 C6H2BrO- 1 168.9295 0.52
  248.8557 C6H3Br2O- 1 248.8556 0.23
PK$NUM_PEAK: 2
PK$PEAK: m/z int. rel.int.
  168.9295 4415.2 14
  248.8557 306733.6 999