ACCESSION: MSBNK-CASMI_2016-SM882501
RECORD_TITLE: Icaridin; LC-ESI-QFT; MS2; CE: 35 NCE; R=35000; [M+H]+
DATE: 2016.12.12
AUTHORS: Krauss M, Schymanski EL, Weidauer C, Schupke H, UFZ and Eawag
LICENSE: CC BY
COPYRIGHT: Copyright (C) 2016 UFZ/Eawag
PUBLICATION: Schymanski, E. L.; Ruttkies, C.; Krauss, M.; Brouard, C.; Kind, T.; Dührkop, K.; Allen, F.; Vaniya, A.; Verdegem, D.; Böcker, S.; et al. Critical Assessment of Small Molecule Identification 2016: Automated Methods. Journal of Cheminformatics 2017, 9 (1). DOI:10.1186/s13321-017-0207-1
COMMENT: CONFIDENCE standard compound
COMMENT: INTERNAL_ID 8825

CH$NAME: Icaridin
CH$NAME: Butan-2-yl 2-(2-hydroxyethyl)piperidine-1-carboxylate
CH$COMPOUND_CLASS: N/A; Environmental Standard
CH$FORMULA: C12H23NO3
CH$EXACT_MASS: 229.16779
CH$SMILES: CCC(C)OC(=O)N1CCCCC1CCO
CH$IUPAC: InChI=1S/C12H23NO3/c1-3-10(2)16-12(15)13-8-5-4-6-11(13)7-9-14/h10-11,14H,3-9H2,1-2H3
CH$LINK: CAS 119515-38-7
CH$LINK: PUBCHEM CID:125098
CH$LINK: INCHIKEY QLHULAHOXSSASE-UHFFFAOYSA-N
CH$LINK: CHEMSPIDER 111359
CH$LINK: COMPTOX DTXSID0034227

AC$INSTRUMENT: Q Exactive Plus Orbitrap Thermo Scientific
AC$INSTRUMENT_TYPE: LC-ESI-QFT
AC$MASS_SPECTROMETRY: MS_TYPE MS2
AC$MASS_SPECTROMETRY: ION_MODE POSITIVE
AC$MASS_SPECTROMETRY: IONIZATION ESI
AC$MASS_SPECTROMETRY: FRAGMENTATION_MODE HCD
AC$MASS_SPECTROMETRY: COLLISION_ENERGY 35 (nominal)
AC$MASS_SPECTROMETRY: RESOLUTION 35000
AC$CHROMATOGRAPHY: COLUMN_NAME Kinetex C18 EVO 2.6 um, 2.1x50 mm, precolumn 2.1x5 mm, Phenomenex
AC$CHROMATOGRAPHY: FLOW_GRADIENT 95/5 at 0 min, 95/5 at 1 min, 0/100 at 13 min, 0/100 at 24 min
AC$CHROMATOGRAPHY: FLOW_RATE 300 uL/min
AC$CHROMATOGRAPHY: RETENTION_TIME 10.693 min
AC$CHROMATOGRAPHY: SOLVENT A water with 0.1% formic acid
AC$CHROMATOGRAPHY: SOLVENT B methanol with 0.1% formic acid

MS$FOCUSED_ION: BASE_PEAK 230.1749
MS$FOCUSED_ION: PRECURSOR_M/Z 230.1751
MS$FOCUSED_ION: PRECURSOR_TYPE [M+H]+
MS$DATA_PROCESSING: RECALIBRATE loess on assigned fragments and MS1
MS$DATA_PROCESSING: REANALYZE Peaks with additional N2/O included
MS$DATA_PROCESSING: WHOLE RMassBank 2.3.1

PK$SPLASH: splash10-001i-1900000000-249ca27fad4a72f488fd
PK$ANNOTATION: m/z tentative_formula formula_count mass error(ppm)
  56.0497 C3H6N+ 1 56.0495 3.18
  57.0337 C3H5O+ 1 57.0335 3.77
  57.07 C4H9+ 1 57.0699 2.81
  67.0543 C5H7+ 1 67.0542 1.52
  69.07 C5H9+ 1 69.0699 1.28
  70.0652 C4H8N+ 1 70.0651 0.94
  71.0492 C4H7O+ 1 71.0491 0.98
  83.0856 C6H11+ 1 83.0855 1.25
  84.0808 C5H10N+ 1 84.0808 0.31
  93.0699 C7H9+ 1 93.0699 0.21
  95.0855 C7H11+ 1 95.0855 0.19
  112.1121 C7H14N+ 1 112.1121 0.38
  113.0961 C7H13O+ 1 113.0961 0.36
  128.0706 C6H10NO2+ 1 128.0706 0.34
  130.1227 C7H16NO+ 1 130.1226 0.14
  156.102 C8H14NO2+ 1 156.1019 0.54
  174.1126 C8H16NO3+ 1 174.1125 0.55
  186.1853 C11H24NO+ 1 186.1852 0.23
  230.1752 C12H24NO3+ 1 230.1751 0.48
PK$NUM_PEAK: 19
PK$PEAK: m/z int. rel.int.
  56.0497 1418593.6 2
  57.0337 792033.1 1
  57.07 1919455.1 3
  67.0543 9378628 19
  69.07 1901789.1 3
  70.0652 3043828 6
  71.0492 16766596 34
  83.0856 981653.2 2
  84.0808 9380080 19
  93.0699 2454326 5
  95.0855 25282246 51
  112.1121 32861584 67
  113.0961 8945846 18
  128.0706 13229252 27
  130.1227 486590432 999
  156.102 31385888 64
  174.1126 23114636 47
  186.1853 2046713 4
  230.1752 16108737 33