ACCESSION: MSBNK-Fac_Eng_Univ_Tokyo-JP000502
RECORD_TITLE: TRIMETHYLHYDRAZINE; EI-B; MS
DATE: 2016.01.19 (Created 2008.10.21, modified 2011.05.06)
AUTHORS: SASAKI S, TOYOHASHI UNIV. OF TECH.
LICENSE: CC BY-NC-SA

CH$NAME: TRIMETHYLHYDRAZINE
CH$COMPOUND_CLASS: N/A
CH$FORMULA: C3H10N2
CH$EXACT_MASS: 74.08440
CH$SMILES: CNN(C)C
CH$IUPAC: InChI=1S/C3H10N2/c1-4-5(2)3/h4H,1-3H3
CH$LINK: INCHIKEY NIIPNAJXERMYOG-UHFFFAOYSA-N
CH$LINK: COMPTOX DTXSID80169760

AC$INSTRUMENT: SHIMADZU LKB-2091
AC$INSTRUMENT_TYPE: EI-B
AC$MASS_SPECTROMETRY: MS_TYPE MS
AC$MASS_SPECTROMETRY: ION_MODE POSITIVE
AC$MASS_SPECTROMETRY: IONIZATION_ENERGY 70 eV

MS$FOCUSED_ION: ION_TYPE [M]+*

PK$SPLASH: splash10-0ab9-9000000000-09f2db854fd25befd30f
PK$NUM_PEAK: 22
PK$PEAK: m/z int. rel.int.
  27 2.8 28
  28 3.6 36
  29 3.4 34
  30 3.25 33
  31 5.8 58
  32 7.6 76
  36 1.7 17
  40 0.11 1
  41 2.1 21
  42 26.5 265
  43 12 120
  44 1.69 17
  45 2.3 23
  46 2.6 26
  57 3.1 31
  58 0.16 2
  59 99.99 999
  60 3.2 32
  71 0.7 7
  73 0.25 3
  74 61.5 615
  75 4.1 41