ACCESSION: MSBNK-Fac_Eng_Univ_Tokyo-JP000516
RECORD_TITLE: TRIALLYLHYDRAZINE; EI-B; MS
DATE: 2016.01.19 (Created 2008.10.21, modified 2011.05.06)
AUTHORS: SASAKI S, TOYOHASHI UNIV. OF TECH.
LICENSE: CC BY-NC-SA

CH$NAME: TRIALLYLHYDRAZINE
CH$COMPOUND_CLASS: N/A
CH$FORMULA: C9H16N2
CH$EXACT_MASS: 152.13135
CH$SMILES: C=CCNN(CC=C)CC=C
CH$IUPAC: InChI=1S/C9H16N2/c1-4-7-10-11(8-5-2)9-6-3/h4-6,10H,1-3,7-9H2
CH$LINK: INCHIKEY DQSIAGHCYOKRFM-UHFFFAOYSA-N

AC$INSTRUMENT: SHIMADZU LKB-2091
AC$INSTRUMENT_TYPE: EI-B
AC$MASS_SPECTROMETRY: MS_TYPE MS
AC$MASS_SPECTROMETRY: ION_MODE POSITIVE
AC$MASS_SPECTROMETRY: IONIZATION_ENERGY 70 eV

MS$FOCUSED_ION: ION_TYPE [M]+*

PK$SPLASH: splash10-0006-9300000000-1eb86cd3bdad3cb5db25
PK$NUM_PEAK: 26
PK$PEAK: m/z int. rel.int.
  28 7.8 78
  29 4.1 41
  30 3.3 33
  38 0.09 1
  39 18.9 189
  40 3 30
  41 99.99 999
  42 0.93 9
  43 4.1 41
  53 1.3 13
  54 3.3 33
  55 0.74 7
  56 5 50
  57 1.1 11
  67 1.4 14
  68 0.16 2
  69 2.8 28
  70 1.4 14
  81 1.8 18
  83 0.1 1
  94 0.8 8
  111 42.6 426
  112 3.7 37
  113 0.17 2
  152 10.4 104
  153 1.2 12