ACCESSION: MSBNK-Fac_Eng_Univ_Tokyo-JP000568
RECORD_TITLE: TRIDECANOIC ACID TRIMETHYLSILYL ESTER; EI-B; MS
DATE: 2016.01.19 (Created 2008.10.21, modified 2011.05.06)
AUTHORS: KOGA M, UNIV. OF OCCUPATIONAL AND ENVIRONMENTAL HEALTH
LICENSE: CC BY-NC-SA

CH$NAME: TRIDECANOIC ACID TRIMETHYLSILYL ESTER
CH$COMPOUND_CLASS: N/A
CH$FORMULA: C16H34O2Si
CH$EXACT_MASS: 286.23281
CH$SMILES: CCCCCCCCCCCCC(=O)O[Si](C)(C)C
CH$IUPAC: InChI=1S/C16H34O2Si/c1-5-6-7-8-9-10-11-12-13-14-15-16(17)18-19(2,3)4/h5-15H2,1-4H3
CH$LINK: INCHIKEY UZUTZCYXYDHJAT-UHFFFAOYSA-N

AC$INSTRUMENT: JEOL JMS-01-SG
AC$INSTRUMENT_TYPE: EI-B
AC$MASS_SPECTROMETRY: MS_TYPE MS
AC$MASS_SPECTROMETRY: ION_MODE POSITIVE
AC$MASS_SPECTROMETRY: IONIZATION_ENERGY 70 eV

MS$FOCUSED_ION: ION_TYPE [M]+*

PK$SPLASH: splash10-00bc-9110000000-d82340760ca3f00725e3
PK$NUM_PEAK: 19
PK$PEAK: m/z int. rel.int.
  43 75.6 756
  45 10 100
  47 9.7 97
  55 2.64 26
  57 8.8 88
  69 10.3 103
  73 99.99 999
  74 0.97 10
  75 96.3 963
  76 6.3 63
  77 21.8 218
  117 7.5 75
  118 6.9 69
  129 24 240
  131 13 130
  132 2.58 26
  145 17 170
  271 38.9 389
  272 6.9 69