ACCESSION: MSBNK-Fac_Eng_Univ_Tokyo-JP001022
RECORD_TITLE: XANTHENE-9-CARBOXYLIC ACID TRIMETHYLSILYLESTER; EI-B; MS
DATE: 2016.01.19 (Created 2008.10.21, modified 2011.05.06)
AUTHORS: KOGA M, UNIV. OF OCCUPATIONAL AND ENVIRONMENTAL HEALTH
LICENSE: CC BY-NC-SA

CH$NAME: XANTHENE-9-CARBOXYLIC ACID TRIMETHYLSILYLESTER
CH$NAME: TRIMETHYLSILYL XANTHENE-9-CARBOXYLATE
CH$COMPOUND_CLASS: N/A
CH$FORMULA: C17H18O3Si
CH$EXACT_MASS: 298.10252
CH$SMILES: N/A
CH$IUPAC: N/A

AC$INSTRUMENT: JEOL JMS-01-SG
AC$INSTRUMENT_TYPE: EI-B
AC$MASS_SPECTROMETRY: MS_TYPE MS
AC$MASS_SPECTROMETRY: ION_MODE POSITIVE
AC$MASS_SPECTROMETRY: IONIZATION_ENERGY 70 eV

MS$FOCUSED_ION: ION_TYPE [M]+*

PK$SPLASH: splash10-001i-6940000000-447419dd99b37c93ea9a
PK$NUM_PEAK: 12
PK$PEAK: m/z int. rel.int.
  44 11.4 114
  45 43.8 438
  47 6.8 68
  73 8.01 80
  74 6.9 69
  75 13.7 137
  152 10.8 108
  181 99.99 999
  182 15.6 156
  254 6.1 61
  269 45.5 455
  270 10.4 104