ACCESSION: MSBNK-Fac_Eng_Univ_Tokyo-JP001249
RECORD_TITLE: (CIS)FLAVAN-4-OL ACETATE; EI-B; MS
DATE: 2016.01.19 (Created 2008.10.21, modified 2011.05.06)
AUTHORS: SASAKI S, TOYOHASHI UNIV. OF TECH.
LICENSE: CC BY-NC-SA

CH$NAME: (CIS)FLAVAN-4-OL ACETATE
CH$NAME: CIS-2-PHENYLCHROMAN-4-YL ACETATE
CH$COMPOUND_CLASS: N/A
CH$FORMULA: C17H16O3
CH$EXACT_MASS: 268.10994
CH$SMILES: N/A
CH$IUPAC: N/A

AC$INSTRUMENT: HITACHI RMU-6D
AC$INSTRUMENT_TYPE: EI-B
AC$MASS_SPECTROMETRY: MS_TYPE MS
AC$MASS_SPECTROMETRY: ION_MODE POSITIVE
AC$MASS_SPECTROMETRY: IONIZATION_ENERGY 70 eV

MS$FOCUSED_ION: ION_TYPE [M]+*

PK$SPLASH: splash10-0a4i-4590000000-5c7c01468ee89ed34a41
PK$NUM_PEAK: 77
PK$PEAK: m/z int. rel.int.
  14 1 10
  15 3.7 37
  16 0.3 3
  17 0.03 0
  18 3 30
  27 1 10
  28 7 70
  29 0.1 1
  32 0.7 7
  39 4.3 43
  40 0.3 3
  41 0.03 0
  42 2 20
  43 18 180
  44 0.7 7
  45 1.3 13
  50 3 30
  51 9 90
  52 2 20
  60 1 10
  62 1 10
  63 5 50
  64 1 10
  65 0.25 3
  74 2 20
  75 3 30
  76 9 90
  77 1.3 13
  78 2.7 27
  81 1 10
  89 12 120
  90 0.1 1
  91 3 30
  93 0.3 3
  94 0.3 3
  95 0.07 1
  103 6.3 63
  104 5 50
  105 6 60
  106 0.2 2
  113 0.7 7
  114 0.7 7
  115 6.7 67
  116 0.07 1
  120 0.3 3
  121 1 10
  122 2 20
  126 0.1 1
  127 1 10
  128 1 10
  130 2 20
  131 6.1 61
  132 5 50
  139 2 20
  150 1 10
  151 0.3 3
  152 6.3 63
  153 1 10
  163 0.3 3
  164 0.07 1
  165 5 50
  166 1 10
  176 3.3 33
  177 0.33 3
  178 20 200
  179 8 80
  180 2 20
  181 0.2 2
  189 6 60
  190 1 10
  191 0.7 7
  205 0.17 2
  206 2 20
  207 99.99 999
  208 80 800
  209 1.2 12
  210 1 10