ACCESSION: MSBNK-Fac_Eng_Univ_Tokyo-JP001440
RECORD_TITLE: TRIPHENYLSILANE; EI-B; MS
DATE: 2016.01.19 (Created 2008.10.21, modified 2011.05.06)
AUTHORS: MASS SPECTROSCOPY SOC. OF JAPAN (MSSJ)
LICENSE: CC BY-NC-SA

CH$NAME: TRIPHENYLSILANE
CH$COMPOUND_CLASS: N/A
CH$FORMULA: C18H16Si
CH$EXACT_MASS: 260.10213
CH$SMILES: c(c3)ccc(c3)[SiH](c(c2)cccc2)c(c1)cccc1
CH$IUPAC: InChI=1S/C18H16Si/c1-4-10-16(11-5-1)19(17-12-6-2-7-13-17)18-14-8-3-9-15-18/h1-15,19H
CH$LINK: INCHIKEY AKQNYQDSIDKVJZ-UHFFFAOYSA-N
CH$LINK: COMPTOX DTXSID10883583

AC$INSTRUMENT: JEOL JMS-D-3000
AC$INSTRUMENT_TYPE: EI-B
AC$MASS_SPECTROMETRY: MS_TYPE MS
AC$MASS_SPECTROMETRY: ION_MODE POSITIVE
AC$MASS_SPECTROMETRY: IONIZATION_ENERGY 70 eV

MS$FOCUSED_ION: ION_TYPE [M]+*

PK$SPLASH: splash10-001i-0900000000-a701308cfbdd4e26e15c
PK$NUM_PEAK: 23
PK$PEAK: m/z int. rel.int.
  51 1.53 15
  53 6.22 62
  77 1.57 16
  78 2.94 29
  79 4.54 45
  91 1.67 17
  103 2.51 25
  104 1.13 11
  105 23.62 236
  106 3.33 33
  107 1.13 11
  129 2.07 21
  154 1.06 11
  155 3.87 39
  179 1.35 14
  180 12.52 125
  181 50.82 508
  182 99.99 999
  183 24.48 245
  184 5.95 60
  259 6.33 63
  260 11.8 118
  261 3.11 31