ACCESSION: MSBNK-Fac_Eng_Univ_Tokyo-JP002312
RECORD_TITLE: TRIMETHYLSILYL HEXANOATE; EI-B; MS
DATE: 2016.01.19 (Created 2008.10.21, modified 2011.05.06)
AUTHORS: MASS SPECTROSCOPY SOC. OF JAPAN (MSSJ)
LICENSE: CC BY-NC-SA

CH$NAME: TRIMETHYLSILYL HEXANOATE
CH$COMPOUND_CLASS: N/A
CH$FORMULA: C9H20O2Si
CH$EXACT_MASS: 188.12326
CH$SMILES: CCCCCC(=O)O[Si](C)(C)C
CH$IUPAC: InChI=1S/C9H20O2Si/c1-5-6-7-8-9(10)11-12(2,3)4/h5-8H2,1-4H3
CH$LINK: INCHIKEY CYXNJMDACJPPRR-UHFFFAOYSA-N
CH$LINK: COMPTOX DTXSID80333848

AC$INSTRUMENT: JEOL JMS-D-3000
AC$INSTRUMENT_TYPE: EI-B
AC$MASS_SPECTROMETRY: MS_TYPE MS
AC$MASS_SPECTROMETRY: ION_MODE POSITIVE
AC$MASS_SPECTROMETRY: IONIZATION_ENERGY 70 eV

MS$FOCUSED_ION: ION_TYPE [M]+*

PK$SPLASH: splash10-00fr-9300000000-a578dc8e72e90713c600
PK$NUM_PEAK: 17
PK$PEAK: m/z int. rel.int.
  42 6.85 69
  43 6.29 63
  45 8.61 86
  47 6.18 62
  55 6.75 68
  60 5.27 53
  61 7.02 70
  73 99.99 999
  74 9.85 99
  75 99.01 990
  76 7.18 72
  117 26.33 263
  131 7.6 76
  132 12.22 122
  173 48.07 481
  174 6.71 67
  188 0.89 9