ACCESSION: MSBNK-Fac_Eng_Univ_Tokyo-JP002339
RECORD_TITLE: CARBON TETRACHLORIDE; EI-B; MS
DATE: 2016.01.19 (Created 2008.10.21, modified 2011.05.06)
AUTHORS: MASS SPECTROSCOPY SOC. OF JAPAN (MSSJ)
LICENSE: CC BY-NC-SA

CH$NAME: CARBON TETRACHLORIDE
CH$NAME: TETRACHLOROMETHANE
CH$COMPOUND_CLASS: N/A
CH$FORMULA: CCl4
CH$EXACT_MASS: 151.87541
CH$SMILES: ClC(Cl)(Cl)Cl
CH$IUPAC: InChI=1S/CCl4/c2-1(3,4)5
CH$LINK: INCHIKEY VZGDMQKNWNREIO-UHFFFAOYSA-N
CH$LINK: COMPTOX DTXSID8020250

AC$INSTRUMENT: JEOL JMS-D-3000
AC$INSTRUMENT_TYPE: EI-B
AC$MASS_SPECTROMETRY: MS_TYPE MS
AC$MASS_SPECTROMETRY: ION_MODE POSITIVE
AC$MASS_SPECTROMETRY: IONIZATION_ENERGY 70 eV

MS$FOCUSED_ION: ION_TYPE [M]+*

PK$SPLASH: splash10-014i-3900000000-3ee1252607af104d66c6
PK$NUM_PEAK: 15
PK$PEAK: m/z int. rel.int.
  47 20.81 208
  49 7.18 72
  58 4.14 41
  59 3.94 39
  60 1.27 13
  70 1.44 14
  82 23.99 240
  84 15.46 155
  86 2.58 26
  117 99.99 999
  118 1.15 12
  119 97.63 976
  120 1.1 11
  121 31 310
  123 3.43 34