ACCESSION: MSBNK-Fac_Eng_Univ_Tokyo-JP002357
RECORD_TITLE: TRIMETHYLSILYLMETHANETHIOL; EI-B; MS
DATE: 2016.01.19 (Created 2008.10.21, modified 2011.05.06)
AUTHORS: MASS SPECTROSCOPY SOC. OF JAPAN (MSSJ)
LICENSE: CC BY-NC-SA

CH$NAME: TRIMETHYLSILYLMETHANETHIOL
CH$COMPOUND_CLASS: N/A
CH$FORMULA: C4H12SSi
CH$EXACT_MASS: 120.04290
CH$SMILES: SC[Si](C)(C)C
CH$IUPAC: InChI=1S/C4H12SSi/c1-6(2,3)4-5/h5H,4H2,1-3H3
CH$LINK: INCHIKEY IIYTXTQVIDHSSL-UHFFFAOYSA-N
CH$LINK: COMPTOX DTXSID70171175

AC$INSTRUMENT: JEOL JMS-D-3000
AC$INSTRUMENT_TYPE: EI-B
AC$MASS_SPECTROMETRY: MS_TYPE MS
AC$MASS_SPECTROMETRY: ION_MODE POSITIVE
AC$MASS_SPECTROMETRY: IONIZATION_ENERGY 70 eV

MS$FOCUSED_ION: ION_TYPE [M]+*

PK$SPLASH: splash10-00dl-9100000000-dd3bd3d8e561bd24ef2c
PK$NUM_PEAK: 27
PK$PEAK: m/z int. rel.int.
  42 3.25 33
  43 24.93 249
  44 62.85 629
  45 25.38 254
  46 5.03 50
  47 3.85 39
  48 3.78 38
  53 1.79 18
  55 1.9 19
  57 1.9 19
  58 7.15 72
  59 25.19 252
  60 2.26 23
  61 2.93 29
  64 4.27 43
  72 2.29 23
  73 99.99 999
  74 11.48 115
  75 14.43 144
  77 16.44 164
  105 28.57 286
  106 2.69 27
  107 2.62 26
  117 4.99 50
  119 4.92 49
  120 15.26 153
  121 2.48 25