ACCESSION: MSBNK-Fac_Eng_Univ_Tokyo-JP003057
RECORD_TITLE: TRIPHENYLPHOSPHINE; EI-B; MS
DATE: 2016.01.19 (Created 2008.10.21, modified 2011.05.06)
AUTHORS: SASAKI S, TOYOHASHI UNIV. OF TECH.
LICENSE: CC BY-NC-SA

CH$NAME: TRIPHENYLPHOSPHINE
CH$COMPOUND_CLASS: N/A
CH$FORMULA: C18H15P
CH$EXACT_MASS: 262.09114
CH$SMILES: N/A
CH$IUPAC: N/A

AC$INSTRUMENT: Unknown
AC$INSTRUMENT_TYPE: EI-B
AC$MASS_SPECTROMETRY: MS_TYPE MS
AC$MASS_SPECTROMETRY: ION_MODE POSITIVE

MS$FOCUSED_ION: ION_TYPE [M]+*

PK$SPLASH: splash10-03e9-1970000000-5e4c986b363718ea76cf
PK$NUM_PEAK: 29
PK$PEAK: m/z int. rel.int.
  51 5 50
  57 2.1 21
  63 2.1 21
  65 0.16 2
  77 3.2 32
  78 1.3 13
  91 2.4 24
  107 1.16 12
  108 32 320
  109 2.9 29
  115 2.7 27
  131 0.22 2
  133 2.5 25
  152 7.1 71
  153 1.9 19
  154 0.21 2
  157 3.3 33
  170 2.5 25
  181 1.5 15
  182 0.01 0
  183 61 610
  184 13 130
  185 10 100
  186 0.13 1
  260 1.5 15
  261 12.2 122
  262 99.99 999
  263 0.2 2
  264 2 20