ACCESSION: MSBNK-Fac_Eng_Univ_Tokyo-JP003246
RECORD_TITLE: TRIETHYL PHOSPHATE; EI-B; MS
DATE: 2016.01.19 (Created 2008.10.21, modified 2011.05.06)
AUTHORS: MASS SPECTROSCOPY SOC. OF JAPAN (MSSJ)
LICENSE: CC BY-NC-SA

CH$NAME: TRIETHYL PHOSPHATE
CH$COMPOUND_CLASS: N/A
CH$FORMULA: C6H15O4P
CH$EXACT_MASS: 182.07080
CH$SMILES: CCOP(=O)(OCC)OCC
CH$IUPAC: InChI=1S/C6H15O4P/c1-4-8-11(7,9-5-2)10-6-3/h4-6H2,1-3H3
CH$LINK: INCHIKEY DQWPFSLDHJDLRL-UHFFFAOYSA-N
CH$LINK: COMPTOX DTXSID8026228

AC$INSTRUMENT: HITACHI RMU-6E
AC$INSTRUMENT_TYPE: EI-B
AC$MASS_SPECTROMETRY: MS_TYPE MS
AC$MASS_SPECTROMETRY: ION_MODE POSITIVE
AC$MASS_SPECTROMETRY: IONIZATION_ENERGY 70 eV

MS$FOCUSED_ION: ION_TYPE [M]+*

PK$SPLASH: splash10-0a7j-4900000000-894df777670b58419247
PK$NUM_PEAK: 12
PK$PEAK: m/z int. rel.int.
  81 71 710
  82 55 550
  99 95 950
  109 67 670
  111 27 270
  125 34 340
  127 82 820
  137 23 230
  138 27 270
  139 20 200
  155 99.99 999
  182 28 280