ACCESSION: MSBNK-Fac_Eng_Univ_Tokyo-JP003669
RECORD_TITLE: VERALKAMINE; EI-B; MS
DATE: 2016.01.19 (Created 2008.10.21, modified 2011.05.06)
AUTHORS: SASAKI S, TOYOHASHI UNIV. OF TECH.
LICENSE: CC BY-NC-SA

CH$NAME: VERALKAMINE
CH$COMPOUND_CLASS: N/A
CH$FORMULA: C27H43NO2
CH$EXACT_MASS: 413.32938
CH$SMILES: N/A
CH$IUPAC: N/A

AC$INSTRUMENT: Unknown
AC$INSTRUMENT_TYPE: EI-B
AC$MASS_SPECTROMETRY: MS_TYPE MS
AC$MASS_SPECTROMETRY: ION_MODE POSITIVE

MS$FOCUSED_ION: ION_TYPE [M]+*

PK$SPLASH: splash10-0002-9100000000-587714ac6070c95d598d
PK$NUM_PEAK: 57
PK$PEAK: m/z int. rel.int.
  28 2.5 25
  29 2 20
  30 4.5 45
  39 0.13 1
  41 5.5 55
  42 1.8 18
  43 4.2 42
  44 0.12 1
  53 1.4 14
  55 7 70
  56 7.9 79
  57 0.31 3
  67 2.6 26
  68 1.5 15
  69 2.4 24
  70 0.46 5
  77 1.5 15
  79 3.1 31
  81 3.1 31
  82 0.19 2
  91 4.6 46
  93 2.1 21
  97 2.4 24
  98 99.99 999
  99 8.2 82
  105 4 40
  106 0.8 8
  107 0.02 0
  109 0.9 9
  110 1.2 12
  112 1.6 16
  117 0.12 1
  119 1.8 18
  120 0.9 9
  124 1.7 17
  125 0.69 7
  126 3 30
  127 1.6 16
  129 1.5 15
  131 0.23 2
  132 0.7 7
  133 1.2 12
  141 0.7 7
  143 0.15 2
  145 2.4 24
  157 1 10
  159 0.8 8
  370 0.06 1
  381 0.2 2
  393 0.3 3
  394 0.4 4
  395 0.08 1
  396 0.4 4
  411 0.3 3
  412 0.4 4
  413 0.13 1
  414 0.4 4