ACCESSION: MSBNK-Fac_Eng_Univ_Tokyo-JP003717
RECORD_TITLE: O,N-DIMETHYLHYDROXYLAMINE; EI-B; MS
DATE: 2016.01.19 (Created 2008.10.21, modified 2011.05.06)
AUTHORS: SASAKI S, TOYOHASHI UNIV. OF TECH.
LICENSE: CC BY-NC-SA

CH$NAME: O,N-DIMETHYLHYDROXYLAMINE
CH$COMPOUND_CLASS: N/A
CH$FORMULA: C2H7NO
CH$EXACT_MASS: 61.05276
CH$SMILES: CNOC
CH$IUPAC: InChI=1S/C2H7NO/c1-3-4-2/h3H,1-2H3
CH$LINK: INCHIKEY KRKPYFLIYNGWTE-UHFFFAOYSA-N
CH$LINK: COMPTOX DTXSID5051577

AC$INSTRUMENT: Unknown
AC$INSTRUMENT_TYPE: EI-B
AC$MASS_SPECTROMETRY: MS_TYPE MS
AC$MASS_SPECTROMETRY: ION_MODE POSITIVE

MS$FOCUSED_ION: ION_TYPE [M]+*

PK$SPLASH: splash10-01ot-9000000000-226a9d378ab006901c3d
PK$NUM_PEAK: 10
PK$PEAK: m/z int. rel.int.
  41 1 10
  42 3 30
  43 2 20
  44 0.2 2
  45 14 140
  46 99.99 999
  47 2 20
  60 0.21 2
  61 90 900
  62 2 20