ACCESSION: MSBNK-Fac_Eng_Univ_Tokyo-JP004111
RECORD_TITLE: NAPHTHALENE; EI-B; MS
DATE: 2016.01.19 (Created 2008.10.21, modified 2011.05.06)
AUTHORS: YAMAMOTO M, DEP. CHEMISTRY, FAC. SCIENCE, NARA WOMEN'S UNIV.
LICENSE: CC BY-NC-SA

CH$NAME: NAPHTHALENE
CH$COMPOUND_CLASS: N/A
CH$FORMULA: C10H8
CH$EXACT_MASS: 128.06260
CH$SMILES: c(c2)cc(c1)c(c2)ccc1
CH$IUPAC: InChI=1S/C10H8/c1-2-6-10-8-4-3-7-9(10)5-1/h1-8H
CH$LINK: INCHIKEY UFWIBTONFRDIAS-UHFFFAOYSA-N
CH$LINK: COMPTOX DTXSID8020913

AC$INSTRUMENT: HITACHI RMU-6E
AC$INSTRUMENT_TYPE: EI-B
AC$MASS_SPECTROMETRY: MS_TYPE MS
AC$MASS_SPECTROMETRY: ION_MODE POSITIVE
AC$MASS_SPECTROMETRY: IONIZATION_ENERGY 70 eV

MS$FOCUSED_ION: ION_TYPE [M]+*

PK$SPLASH: splash10-004i-2900000000-837afe39d2806871be73
PK$NUM_PEAK: 21
PK$PEAK: m/z int. rel.int.
  39 1.2 12
  50 2.6 26
  51 8 80
  62 1.3 13
  63 5.3 53
  63.5 1 10
  64 9 90
  64.5 0.11 1
  74 2.8 28
  75 3.5 35
  76 2.8 28
  77 0.4 4
  78 2.6 26
  87 1 10
  98 1.2 12
  101 0.3 3
  102 6.5 65
  126 7.6 76
  127 13 130
  128 99.99 999
  129 12 120