ACCESSION: MSBNK-Fac_Eng_Univ_Tokyo-JP004660
RECORD_TITLE: (DIIODOMETHYL)TRIMETHYLSILANE; EI-B; MS
DATE: 2016.01.19 (Created 2008.10.21, modified 2011.05.06)
AUTHORS: MASS SPECTROSCOPY SOC. OF JAPAN (MSSJ)
LICENSE: CC BY-NC-SA

CH$NAME: (DIIODOMETHYL)TRIMETHYLSILANE
CH$COMPOUND_CLASS: N/A
CH$FORMULA: C4H10I2Si
CH$EXACT_MASS: 339.86411
CH$SMILES: C[Si](C)(C)C(I)I
CH$IUPAC: InChI=1S/C4H10I2Si/c1-7(2,3)4(5)6/h4H,1-3H3
CH$LINK: INCHIKEY RXBPBTHLRBDCFU-UHFFFAOYSA-N

AC$INSTRUMENT: JEOL JMS-D-3000
AC$INSTRUMENT_TYPE: EI-B
AC$MASS_SPECTROMETRY: MS_TYPE MS
AC$MASS_SPECTROMETRY: ION_MODE POSITIVE
AC$MASS_SPECTROMETRY: IONIZATION_ENERGY 70 eV

MS$FOCUSED_ION: ION_TYPE [M]+*

PK$SPLASH: splash10-000g-6968000000-ad1c209704066aa31e93
PK$NUM_PEAK: 21
PK$PEAK: m/z int. rel.int.
  42 13.34 133
  53 11.65 117
  55 13.15 132
  59 13.53 135
  73 49.43 494
  75 8.45 85
  155 9.21 92
  157 13.15 132
  171 6.76 68
  185 80.45 805
  186 18.79 188
  187 9.21 92
  198 9.58 96
  283 6.39 64
  297 75.75 758
  298 10.33 103
  299 6.01 60
  325 12.03 120
  340 99.99 999
  341 18.98 190
  342 7.7 77