ACCESSION: MSBNK-Fac_Eng_Univ_Tokyo-JP004715
RECORD_TITLE: NAPHTHALENE; EI-B; MS
DATE: 2016.01.19 (Created 2008.10.21, modified 2011.05.06)
AUTHORS: MASS SPECTROSCOPY SOC. OF JAPAN (MSSJ)
LICENSE: CC BY-NC-SA

CH$NAME: NAPHTHALENE
CH$COMPOUND_CLASS: N/A
CH$FORMULA: C10H8
CH$EXACT_MASS: 128.06260
CH$SMILES: c(c2)cc(c1)c(c2)ccc1
CH$IUPAC: InChI=1S/C10H8/c1-2-6-10-8-4-3-7-9(10)5-1/h1-8H
CH$LINK: CAS 91-20-3
CH$LINK: INCHIKEY UFWIBTONFRDIAS-UHFFFAOYSA-N
CH$LINK: COMPTOX DTXSID8020913

AC$INSTRUMENT: JEOL JMS-D-3000
AC$INSTRUMENT_TYPE: EI-B
AC$MASS_SPECTROMETRY: MS_TYPE MS
AC$MASS_SPECTROMETRY: ION_MODE POSITIVE
AC$MASS_SPECTROMETRY: IONIZATION_ENERGY 70 eV

MS$FOCUSED_ION: ION_TYPE [M]+*

PK$SPLASH: splash10-004i-3900000000-0e32d0a2d4bb6373bea3
PK$NUM_PEAK: 18
PK$PEAK: m/z int. rel.int.
  50 2.74 27
  51 10.07 101
  62 1.32 13
  63 6.14 61
  64 10.84 108
  65 1.11 11
  74 2.69 27
  75 3.33 33
  76 2.54 25
  77 3.88 39
  78 2.37 24
  87 1.01 10
  101 2.46 25
  102 5.54 55
  126 5.92 59
  127 12.07 121
  128 99.99 999
  129 10.92 109