ACCESSION: MSBNK-Fac_Eng_Univ_Tokyo-JP004810
RECORD_TITLE: TRIS(TRIMETHYLSILYL)ETHYLENE; EI-B; MS
DATE: 2016.01.19 (Created 2008.10.21, modified 2011.05.06)
AUTHORS: MASS SPECTROSCOPY SOC. OF JAPAN (MSSJ)
LICENSE: CC BY-NC-SA

CH$NAME: TRIS(TRIMETHYLSILYL)ETHYLENE
CH$COMPOUND_CLASS: N/A
CH$FORMULA: C11H28Si3
CH$EXACT_MASS: 244.14988
CH$SMILES: C[Si](C)(C)C=C([Si](C)(C)C)[Si](C)(C)C
CH$IUPAC: InChI=1S/C11H28Si3/c1-12(2,3)10-11(13(4,5)6)14(7,8)9/h10H,1-9H3
CH$LINK: INCHIKEY CUFNUQSBSOKXJH-UHFFFAOYSA-N
CH$LINK: COMPTOX DTXSID80172350

AC$INSTRUMENT: JEOL JMS-D-3000
AC$INSTRUMENT_TYPE: EI-B
AC$MASS_SPECTROMETRY: MS_TYPE MS
AC$MASS_SPECTROMETRY: ION_MODE POSITIVE
AC$MASS_SPECTROMETRY: IONIZATION_ENERGY 70 eV

MS$FOCUSED_ION: ION_TYPE [M]+*

PK$SPLASH: splash10-00di-9400000000-2204b4256a6ae5c69de8
PK$NUM_PEAK: 19
PK$PEAK: m/z int. rel.int.
  43 2.1 21
  45 9.44 94
  59 1.83 18
  73 99.99 999
  74 7.86 79
  75 3.94 39
  83 2.71 27
  97 2.48 25
  141 11.97 120
  142 2.22 22
  143 1.27 13
  155 13.94 139
  156 19.56 196
  157 4.11 41
  158 1.85 19
  171 4.14 41
  229 3.51 35
  244 6.59 66
  245 1.9 19