ACCESSION: MSBNK-Fac_Eng_Univ_Tokyo-JP004916
RECORD_TITLE: TRIMETHYL ORTHOFORMATE; EI-B; MS
DATE: 2016.01.19 (Created 2008.10.21, modified 2011.05.06)
AUTHORS: MASS SPECTROSCOPY SOC. OF JAPAN (MSSJ)
LICENSE: CC BY-NC-SA

CH$NAME: TRIMETHYL ORTHOFORMATE
CH$NAME: TRIMEOXYMETHANE
CH$COMPOUND_CLASS: N/A
CH$FORMULA: C4H10O3
CH$EXACT_MASS: 106.06299
CH$SMILES: COC(OC)OC
CH$IUPAC: InChI=1S/C4H10O3/c1-5-4(6-2)7-3/h4H,1-3H3
CH$LINK: CAS 149-73-5
CH$LINK: INCHIKEY PYOKUURKVVELLB-UHFFFAOYSA-N
CH$LINK: COMPTOX DTXSID7027122

AC$INSTRUMENT: JEOL JMS-D-3000
AC$INSTRUMENT_TYPE: EI-B
AC$MASS_SPECTROMETRY: MS_TYPE MS
AC$MASS_SPECTROMETRY: ION_MODE POSITIVE
AC$MASS_SPECTROMETRY: IONIZATION_ENERGY 70 eV

MS$FOCUSED_ION: ION_TYPE [M]+*

PK$SPLASH: splash10-004i-9000000000-6dda3526ae52cdb0f0b2
PK$NUM_PEAK: 7
PK$PEAK: m/z int. rel.int.
  43 1.21 12
  45 2.19 22
  47 21.87 219
  60 1.51 15
  75 99.99 999
  76 3.59 36
  105 2.57 26