ACCESSION: MSBNK-Fac_Eng_Univ_Tokyo-JP004934
RECORD_TITLE: VINYL ACETATE; EI-B; MS
DATE: 2016.01.19 (Created 2008.10.21, modified 2011.05.06)
AUTHORS: MASS SPECTROSCOPY SOC. OF JAPAN (MSSJ)
LICENSE: CC BY-NC-SA

CH$NAME: VINYL ACETATE
CH$NAME: ACETIC ACID ETHENYL ESTER
CH$COMPOUND_CLASS: N/A
CH$FORMULA: C4H6O2
CH$EXACT_MASS: 86.03678
CH$SMILES: C=COC(C)=O
CH$IUPAC: InChI=1S/C4H6O2/c1-3-6-4(2)5/h3H,1H2,2H3
CH$LINK: CAS 108-05-4
CH$LINK: INCHIKEY XTXRWKRVRITETP-UHFFFAOYSA-N
CH$LINK: COMPTOX DTXSID3021431

AC$INSTRUMENT: JEOL JMS-D-3000
AC$INSTRUMENT_TYPE: EI-B
AC$MASS_SPECTROMETRY: MS_TYPE MS
AC$MASS_SPECTROMETRY: ION_MODE POSITIVE
AC$MASS_SPECTROMETRY: IONIZATION_ENERGY 70 eV

MS$FOCUSED_ION: ION_TYPE [M]+*

PK$SPLASH: splash10-0006-9000000000-822a98d017022e0d3838
PK$NUM_PEAK: 4
PK$PEAK: m/z int. rel.int.
  42 6.08 61
  43 99.99 999
  44 2.55 26
  86 10.55 106