ACCESSION: MSBNK-Fac_Eng_Univ_Tokyo-JP004998
RECORD_TITLE: TRIETHOXYOCTYLSILANE; EI-B; MS
DATE: 2016.01.19 (Created 2008.10.21, modified 2011.05.06)
AUTHORS: MASS SPECTROSCOPY SOC. OF JAPAN (MSSJ)
LICENSE: CC BY-NC-SA

CH$NAME: TRIETHOXYOCTYLSILANE
CH$COMPOUND_CLASS: N/A
CH$FORMULA: C14H32O3Si
CH$EXACT_MASS: 276.21207
CH$SMILES: CCCCCCCC[Si](OCC)(OCC)OCC
CH$IUPAC: InChI=1S/C14H32O3Si/c1-5-9-10-11-12-13-14-18(15-6-2,16-7-3)17-8-4/h5-14H2,1-4H3
CH$LINK: CAS 2943-75-1
CH$LINK: COMPTOX DTXSID2029246
CH$LINK: INCHIKEY MSRJTTSHWYDFIU-UHFFFAOYSA-N
CH$LINK: PUBCHEM CID:76262

AC$INSTRUMENT: JEOL JMS-D-3000
AC$INSTRUMENT_TYPE: EI-B
AC$MASS_SPECTROMETRY: MS_TYPE MS
AC$MASS_SPECTROMETRY: ION_MODE POSITIVE
AC$MASS_SPECTROMETRY: IONIZATION_ENERGY 70 eV

MS$FOCUSED_ION: ION_TYPE [M]+*

PK$SPLASH: splash10-03di-0900000000-221a37e3aa875b4a302e
PK$NUM_PEAK: 14
PK$PEAK: m/z int. rel.int.
  63 3.95 40
  73 1.3 13
  79 4.17 42
  91 3.56 36
  107 2.92 29
  119 15.82 158
  120 1.52 15
  135 4.33 43
  149 3.9 39
  163 99.99 999
  164 12.6 126
  165 4.85 49
  231 1.81 18
  276 1.85 19