ACCESSION: MSBNK-Fac_Eng_Univ_Tokyo-JP005003
RECORD_TITLE: TRIMETHYL(3-UNDECENYL)SILANE; EI-B; MS
DATE: 2016.01.19 (Created 2008.10.21, modified 2011.05.06)
AUTHORS: MASS SPECTROSCOPY SOC. OF JAPAN (MSSJ)
LICENSE: CC BY-NC-SA

CH$NAME: TRIMETHYL(3-UNDECENYL)SILANE
CH$COMPOUND_CLASS: N/A
CH$FORMULA: C14H30Si
CH$EXACT_MASS: 226.21168
CH$SMILES: CCCCCCCC=CCC[Si](C)(C)C
CH$IUPAC: InChI=1S/C14H30Si/c1-5-6-7-8-9-10-11-12-13-14-15(2,3)4/h11-12H,5-10,13-14H2,1-4H3/b12-11+
CH$LINK: INCHIKEY NZAXKKKKVBISRC-VAWYXSNFSA-N

AC$INSTRUMENT: JEOL JMS-D-3000
AC$INSTRUMENT_TYPE: EI-B
AC$MASS_SPECTROMETRY: MS_TYPE MS
AC$MASS_SPECTROMETRY: ION_MODE POSITIVE
AC$MASS_SPECTROMETRY: IONIZATION_ENERGY 70 eV

MS$FOCUSED_ION: ION_TYPE [M]+*

PK$SPLASH: splash10-00di-9000000000-3b590ff6d388ab94de04
PK$NUM_PEAK: 13
PK$PEAK: m/z int. rel.int.
  41 3.18 32
  43 2.33 23
  45 3.45 35
  55 2.22 22
  59 8.57 86
  73 99.99 999
  74 8.66 87
  75 3.77 38
  99 6.53 65
  113 1.86 19
  127 2.97 30
  211 2.31 23
  226 3.09 31