ACCESSION: MSBNK-Fac_Eng_Univ_Tokyo-JP005005
RECORD_TITLE: (29H,31H-PHTHALOCYANINATO(2-)-N(29),N(30),N(31),N(32))NICKEL; EI-B; MS
DATE: 2016.01.19 (Created 2008.10.21, modified 2011.05.06)
AUTHORS: ISA K, FUKUI UNIV.
LICENSE: CC BY-NC-SA

CH$NAME: (29H,31H-PHTHALOCYANINATO(2-)-N(29),N(30),N(31),N(32))NICKEL
CH$NAME: PHTHALOCYANINENICKEL(2)
CH$COMPOUND_CLASS: N/A
CH$FORMULA: C32H16N8Ni
CH$EXACT_MASS: 570.08514
CH$SMILES: N/A
CH$IUPAC: N/A
CH$LINK: CAS 14055-02-8

AC$INSTRUMENT: JEOL JMS-01-SG
AC$INSTRUMENT_TYPE: EI-B
AC$MASS_SPECTROMETRY: MS_TYPE MS
AC$MASS_SPECTROMETRY: ION_MODE POSITIVE
AC$MASS_SPECTROMETRY: IONIZATION_ENERGY 15 eV

MS$FOCUSED_ION: ION_TYPE [M]+*

PK$SPLASH: splash10-00di-0000090000-a14bb116c786b35e025c
PK$NUM_PEAK: 15
PK$PEAK: m/z int. rel.int.
  128 1 10
  186 4 40
  187 1 10
  188 2 20
  285 6 60
  285.5 3 30
  286 3 30
  286.5 1 10
  287 1 10
  570 99.99 999
  571 54 540
  572 54 540
  573 22 220
  574 14 140
  575 5 50