ACCESSION: MSBNK-Fac_Eng_Univ_Tokyo-JP005123
RECORD_TITLE: TRIMETHYLSILYL HEXADECANOATE; EI-B; MS
DATE: 2016.01.19 (Created 2008.10.21, modified 2011.05.06)
AUTHORS: HAYASHI A, FAC. OF SCIENCE AND TECHNOLOGY, KINKI UNIV.
LICENSE: CC BY-NC-SA

CH$NAME: TRIMETHYLSILYL HEXADECANOATE
CH$NAME: TRIMETHYLSILYL PALMITATE
CH$COMPOUND_CLASS: N/A
CH$FORMULA: C19H40O2Si
CH$EXACT_MASS: 328.27976
CH$SMILES: CCCCCCCCCCCCCCCC(=O)O[Si](C)(C)C
CH$IUPAC: InChI=1S/C19H40O2Si/c1-5-6-7-8-9-10-11-12-13-14-15-16-17-18-19(20)21-22(2,3)4/h5-18H2,1-4H3
CH$LINK: CAS 55520-89-3
CH$LINK: INCHIKEY HKNNSWCACQFVIK-UHFFFAOYSA-N
CH$LINK: COMPTOX DTXSID10334702

AC$INSTRUMENT: JEOL JMS-HX-100
AC$INSTRUMENT_TYPE: EI-B
AC$MASS_SPECTROMETRY: MS_TYPE MS
AC$MASS_SPECTROMETRY: ION_MODE POSITIVE
AC$MASS_SPECTROMETRY: IONIZATION_ENERGY 23 eV

MS$FOCUSED_ION: ION_TYPE [M]+*

PK$SPLASH: splash10-03e9-1918000000-30d1994a391641131219
PK$NUM_PEAK: 71
PK$PEAK: m/z int. rel.int.
  55 1.11 11
  69 0.99 10
  73 13.15 132
  74 2.27 23
  75 2.63 26
  81 1.02 10
  83 4.55 46
  84 1.03 10
  85 4.53 45
  87 0.35 4
  95 0.95 10
  96 1.7 17
  97 0.83 8
  98 2.17 22
  101 0.29 3
  103 1.04 10
  109 0.98 10
  111 0.74 7
  112 1.61 16
  116 0.79 8
  117 42.8 428
  118 4.44 44
  119 2.68 27
  125 1.16 12
  129 3.46 35
  130 1.76 18
  131 2.77 28
  132 73.61 736
  133 13.69 137
  134 5.11 51
  143 0.83 8
  145 28.26 283
  146 4.55 46
  147 1.77 18
  159 3.03 30
  171 0.4 4
  174 1.17 12
  185 1.09 11
  187 3.98 40
  188 1.98 20
  194 1.02 10
  199 0.6 6
  201 9.92 99
  202 2.61 26
  203 1.06 11
  215 0.99 10
  227 0.37 4
  228 0.95 10
  229 2.13 21
  236 1.12 11
  241 1 10
  242 1.03 10
  243 2.6 26
  269 4.06 41
  270 1 10
  271 1.12 11
  281 0.97 10
  285 7.61 76
  286 2.05 21
  299 3.51 35
  300 1.27 13
  311 1.97 20
  313 99.99 999
  314 27.05 271
  315 7.96 80
  316 1.47 15
  326 1.08 11
  327 2 20
  328 37.3 373
  329 10.8 108
  330 3.77 38