ACCESSION: MSBNK-Fac_Eng_Univ_Tokyo-JP005233
RECORD_TITLE: (4BETA)-HYDROXYMETHYL-1(2H)-METHYLENE-3,4,(4ABETA),5,8,(8AALPHA)-HEXAHYDRONAPHTHALENE-6(7H)-ONE ETHYLENE ACETAL; EI-B; MS
DATE: 2016.01.19 (Created 2008.10.21, modified 2011.05.06)
AUTHORS: HISAHIRO HAGIWARA, CHEMICAL RESEARCH INSTITUTE OF NON-AQUEOUSSOLUTIONS TOHOKU UNIV.
LICENSE: CC BY-NC-SA

CH$NAME: (4BETA)-HYDROXYMETHYL-1(2H)-METHYLENE-3,4,(4ABETA),5,8,(8AALPHA)-HEXAHYDRONAPHTHALENE-6(7H)-ONE ETHYLENE ACETAL
CH$COMPOUND_CLASS: N/A
CH$FORMULA: C14H22O3
CH$EXACT_MASS: 238.15689
CH$SMILES: N/A
CH$IUPAC: N/A

AC$INSTRUMENT: JEOL JMS-DX-300
AC$INSTRUMENT_TYPE: EI-B
AC$MASS_SPECTROMETRY: MS_TYPE MS
AC$MASS_SPECTROMETRY: ION_MODE POSITIVE
AC$MASS_SPECTROMETRY: IONIZATION_ENERGY 70 eV

MS$FOCUSED_ION: ION_TYPE [M]+*

PK$SPLASH: splash10-0002-9100000000-91f34d2d5afe9c50a495
PK$NUM_PEAK: 37
PK$PEAK: m/z int. rel.int.
  11 16 160
  17 7.6 76
  18 36.5 365
  27 0.24 2
  28 34.8 348
  29 2.6 26
  32 8.6 86
  39 0.27 3
  41 6.4 64
  42 6.5 65
  43 5.2 52
  53 0.26 3
  55 11.8 118
  67 3.1 31
  73 2.6 26
  77 0.38 4
  79 4.8 48
  81 2 20
  83 2.2 22
  86 2.63 26
  87 9 90
  91 6 60
  93 3.7 37
  99 99.99 999
  100 6.8 68
  105 3.7 37
  119 2.8 28
  121 0.21 2
  122 2.2 22
  134 3 30
  152 2.3 23
  155 3.38 34
  156 3.8 38
  167 2.8 28
  176 3.4 34
  238 1.38 14
  239 2.2 22