ACCESSION: MSBNK-Fac_Eng_Univ_Tokyo-JP005508
RECORD_TITLE: (2S)-N-TERT-BUTOXYCARBONYL-2-(2-TETRAHYDROFURANYL)PYRROLIDINE; EI-B; MS
DATE: 2016.01.19 (Created 2008.10.21, modified 2011.05.06)
AUTHORS: HIRAMA M, TOHOKU UNIV. FACULTY OF SCIENCE DEPT. OF CHEMISTRY YUKIBUNSEKI
LICENSE: CC BY-NC-SA

CH$NAME: (2S)-N-TERT-BUTOXYCARBONYL-2-(2-TETRAHYDROFURANYL)PYRROLIDINE
CH$COMPOUND_CLASS: N/A
CH$FORMULA: C13H23NO3
CH$EXACT_MASS: 241.16779
CH$SMILES: CC(C)(C)OC(=O)N(C2)C([H])(CC2)C(C1)OCC1
CH$IUPAC: InChI=1S/C13H23NO3/c1-13(2,3)17-12(15)14-8-4-6-10(14)11-7-5-9-16-11/h10-11H,4-9H2,1-3H3/t10-,11?/m0/s1
CH$LINK: INCHIKEY SHSMIKWWIDAWEM-VUWPPUDQSA-N

AC$INSTRUMENT: HITACHI M-52
AC$INSTRUMENT_TYPE: EI-B
AC$MASS_SPECTROMETRY: MS_TYPE MS
AC$MASS_SPECTROMETRY: ION_MODE POSITIVE
AC$MASS_SPECTROMETRY: IONIZATION_ENERGY 14 eV

MS$FOCUSED_ION: ION_TYPE [M]+*

PK$SPLASH: splash10-03k9-2900000000-00c8ee0d30524209a72d
PK$NUM_PEAK: 6
PK$PEAK: m/z int. rel.int.
  57 3.63 36
  70 38.21 382
  114 99.99 999
  170 56.93 569
  185 4.38 44
  241 1.74 17