ACCESSION: MSBNK-Fac_Eng_Univ_Tokyo-JP005757
RECORD_TITLE: NAPHTHALENE; EI-B; MS
DATE: 2016.01.19 (Created 2008.10.21, modified 2011.05.06)
AUTHORS: MASS SPECTROSCOPY SOC. OF JAPAN (MSSJ)
LICENSE: CC BY-NC-SA

CH$NAME: NAPHTHALENE
CH$COMPOUND_CLASS: N/A
CH$FORMULA: C10H8
CH$EXACT_MASS: 128.06260
CH$SMILES: c(c2)cc(c1)c(c2)ccc1
CH$IUPAC: InChI=1S/C10H8/c1-2-6-10-8-4-3-7-9(10)5-1/h1-8H
CH$LINK: CAS 91-20-3
CH$LINK: INCHIKEY UFWIBTONFRDIAS-UHFFFAOYSA-N
CH$LINK: COMPTOX DTXSID8020913

AC$INSTRUMENT: HITACHI M-80
AC$INSTRUMENT_TYPE: EI-B
AC$MASS_SPECTROMETRY: MS_TYPE MS
AC$MASS_SPECTROMETRY: ION_MODE POSITIVE
AC$MASS_SPECTROMETRY: IONIZATION_ENERGY 70 eV

MS$FOCUSED_ION: ION_TYPE [M]+*

PK$SPLASH: splash10-004i-4900000000-34ade0e20ab7aa4d4e7f
PK$NUM_PEAK: 38
PK$PEAK: m/z int. rel.int.
  37 0.78 8
  38 2.08 21
  39 1.77 18
  49 0.48 5
  50 6.27 63
  51 10.68 107
  52 1.79 18
  61 1.19 12
  62 2.73 27
  63 7.51 75
  64 6.28 63
  65 0.49 5
  67 0.25 3
  68 0.24 2
  73 0.58 6
  74 5.2 52
  75 5.7 57
  76 3.82 38
  77 4.65 47
  78 3.28 33
  79 0.29 3
  87 1.8 18
  88 0.32 3
  89 0.84 8
  98 1.37 14
  99 0.64 6
  100 0.66 7
  101 2.64 26
  102 9.31 93
  103 0.8 8
  121 0.87 9
  122 0.2 2
  125 0.35 4
  126 6.03 60
  127 10.62 106
  128 99.99 999
  129 10.9 109
  130 0.59 6