ACCESSION: MSBNK-Fac_Eng_Univ_Tokyo-JP006055
RECORD_TITLE: TRIMETHYL ORTHOFORMATE; EI-B; MS
DATE: 2016.01.19 (Created 2008.10.21, modified 2011.05.06)
AUTHORS: HASHIMOTO K, KYOTO COLLEGE OF PHARMACY
LICENSE: CC BY-NC-SA

CH$NAME: TRIMETHYL ORTHOFORMATE
CH$NAME: ORTHOFORMIC ACID TRIMETHYL ESTER
CH$COMPOUND_CLASS: N/A
CH$FORMULA: C4H10O3
CH$EXACT_MASS: 106.06299
CH$SMILES: COC(OC)OC
CH$IUPAC: InChI=1S/C4H10O3/c1-5-4(6-2)7-3/h4H,1-3H3
CH$LINK: COMPTOX DTXSID7027122
CH$LINK: INCHIKEY PYOKUURKVVELLB-UHFFFAOYSA-N
CH$LINK: PUBCHEM CID:9005

AC$INSTRUMENT: HITACHI M-80
AC$INSTRUMENT_TYPE: EI-B
AC$MASS_SPECTROMETRY: MS_TYPE MS
AC$MASS_SPECTROMETRY: ION_MODE POSITIVE
AC$MASS_SPECTROMETRY: IONIZATION_ENERGY 20 eV

MS$FOCUSED_ION: ION_TYPE [M]+*

PK$SPLASH: splash10-004i-9000000000-23cdca082c3d11b364d6
PK$NUM_PEAK: 8
PK$PEAK: m/z int. rel.int.
  15 1.53 15
  31 10.55 106
  45 1 10
  47 19.08 191
  75 99.99 999
  76 3.18 32
  105 2.37 24
  106 0.11 1