ACCESSION: MSBNK-Fac_Eng_Univ_Tokyo-JP006056
RECORD_TITLE: TRIETHYL ORTHOFORMATE; EI-B; MS
DATE: 2016.01.19 (Created 2008.10.21, modified 2011.05.06)
AUTHORS: HASHIMOTO K, KYOTO COLLEGE OF PHARMACY
LICENSE: CC BY-NC-SA

CH$NAME: TRIETHYL ORTHOFORMATE
CH$NAME: ORTHOFORMIC ACID TRIETHYL ESTER
CH$COMPOUND_CLASS: N/A
CH$FORMULA: C7H16O3
CH$EXACT_MASS: 148.10994
CH$SMILES: CCOC(OCC)OCC
CH$IUPAC: InChI=1S/C7H16O3/c1-4-8-7(9-5-2)10-6-3/h7H,4-6H2,1-3H3
CH$LINK: INCHIKEY GKASDNZWUGIAMG-UHFFFAOYSA-N
CH$LINK: COMPTOX DTXSID8041957

AC$INSTRUMENT: HITACHI M-80
AC$INSTRUMENT_TYPE: EI-B
AC$MASS_SPECTROMETRY: MS_TYPE MS
AC$MASS_SPECTROMETRY: ION_MODE POSITIVE
AC$MASS_SPECTROMETRY: IONIZATION_ENERGY 20 eV

MS$FOCUSED_ION: ION_TYPE [M]+*

PK$SPLASH: splash10-0ufs-9700000000-eac2c8a5de1de60cb14e
PK$NUM_PEAK: 10
PK$PEAK: m/z int. rel.int.
  29 4.09 41
  45 1.18 12
  47 62.62 626
  63 1.54 15
  75 52.66 527
  76 1.81 18
  103 99.99 999
  104 5.88 59
  147 2.09 21
  148 0.18 2