ACCESSION: MSBNK-Fac_Eng_Univ_Tokyo-JP006804
RECORD_TITLE: TRIMETHOXYPHENYLSILANE; EI-B; MS
DATE: 2016.01.19 (Created 2008.10.21, modified 2011.05.06)
AUTHORS: TAJIMA S, GUNMA COLLEGE OF TECHNOLOGY
LICENSE: CC BY-NC-SA

CH$NAME: TRIMETHOXYPHENYLSILANE
CH$COMPOUND_CLASS: N/A
CH$FORMULA: C9H14O3Si
CH$EXACT_MASS: 198.07122
CH$SMILES: CO[Si](OC)(OC)c(c1)cccc1
CH$IUPAC: InChI=1S/C9H14O3Si/c1-10-13(11-2,12-3)9-7-5-4-6-8-9/h4-8H,1-3H3
CH$LINK: INCHIKEY ZNOCGWVLWPVKAO-UHFFFAOYSA-N
CH$LINK: COMPTOX DTXSID5040700

AC$INSTRUMENT: HITACHI RMU-7M
AC$INSTRUMENT_TYPE: EI-B
AC$MASS_SPECTROMETRY: MS_TYPE MS
AC$MASS_SPECTROMETRY: ION_MODE POSITIVE
AC$MASS_SPECTROMETRY: IONIZATION_ENERGY 70 eV

MS$FOCUSED_ION: ION_TYPE [M]+*

PK$SPLASH: splash10-00dl-6900000000-215dab55c949dee48aac
PK$NUM_PEAK: 26
PK$PEAK: m/z int. rel.int.
  39 1.6 16
  45 7.37 74
  50 2.75 28
  51 7.01 70
  59 28.27 283
  60 5.55 56
  61 9.28 93
  77 5.86 59
  78 4.7 47
  90 42.3 423
  91 48.29 483
  92 5.77 58
  105 2.57 26
  107 26.36 264
  108 2.8 28
  120 99.99 999
  121 42.61 426
  122 7.86 79
  123 2.93 29
  136 4.62 46
  137 9.68 97
  167 18.46 185
  168 3.46 35
  198 26.63 266
  199 3.99 40
  200 1.33 13