ACCESSION: MSBNK-Fac_Eng_Univ_Tokyo-JP006805
RECORD_TITLE: TRIMETHOXYMETHYLSILANE; EI-B; MS
DATE: 2016.01.19 (Created 2008.10.21, modified 2011.05.06)
AUTHORS: TAJIMA S, GUNMA COLLEGE OF TECHNOLOGY
LICENSE: CC BY-NC-SA

CH$NAME: TRIMETHOXYMETHYLSILANE
CH$COMPOUND_CLASS: N/A
CH$FORMULA: C4H12O3Si
CH$EXACT_MASS: 136.05557
CH$SMILES: CO[Si](C)(OC)OC
CH$IUPAC: InChI=1S/C4H12O3Si/c1-5-8(4,6-2)7-3/h1-4H3
CH$LINK: INCHIKEY BFXIKLCIZHOAAZ-UHFFFAOYSA-N
CH$LINK: COMPTOX DTXSID3027370

AC$INSTRUMENT: HITACHI RMU-7M
AC$INSTRUMENT_TYPE: EI-B
AC$MASS_SPECTROMETRY: MS_TYPE MS
AC$MASS_SPECTROMETRY: ION_MODE POSITIVE
AC$MASS_SPECTROMETRY: IONIZATION_ENERGY 70 eV

MS$FOCUSED_ION: ION_TYPE [M]+*

PK$SPLASH: splash10-00di-8900000000-b8f34f43a5c334059c41
PK$NUM_PEAK: 24
PK$PEAK: m/z int. rel.int.
  15 3.36 34
  29 1.93 19
  31 1.6 16
  43 1.6 16
  45 9.07 91
  47 1.51 15
  59 15.11 151
  60 3.19 32
  61 9.24 92
  74 3.61 36
  75 19.23 192
  76 1.85 19
  77 1.76 18
  90 1.85 19
  91 48.87 489
  92 2.69 27
  93 1.85 19
  104 1.01 10
  105 26.78 268
  106 2.1 21
  107 1.51 15
  121 99.99 999
  122 4.2 42
  123 4.03 40