ACCESSION: MSBNK-Fac_Eng_Univ_Tokyo-JP006891
RECORD_TITLE: CAMPHENE; EI-B; MS
DATE: 2016.01.19 (Created 2008.10.21, modified 2011.05.06)
AUTHORS: TAJIMA S, GUNMA COLLEGE OF TECHNOLOGY
LICENSE: CC BY-NC-SA

CH$NAME: CAMPHENE
CH$NAME: 2,2-DIMETHYL-3-METHYLENEBICYCLO(2.2.1)HEPTANE
CH$COMPOUND_CLASS: N/A
CH$FORMULA: C10H16
CH$EXACT_MASS: 136.12520
CH$SMILES: C=C(C21)C(C)(C)C(CC2)C1
CH$IUPAC: InChI=1S/C10H16/c1-7-8-4-5-9(6-8)10(7,2)3/h8-9H,1,4-6H2,2-3H3
CH$LINK: INCHIKEY CRPUJAZIXJMDBK-UHFFFAOYSA-N
CH$LINK: COMPTOX DTXSID8026488

AC$INSTRUMENT: HITACHI M-80B
AC$INSTRUMENT_TYPE: EI-B
AC$MASS_SPECTROMETRY: MS_TYPE MS
AC$MASS_SPECTROMETRY: ION_MODE POSITIVE
AC$MASS_SPECTROMETRY: IONIZATION_ENERGY 70 eV

MS$FOCUSED_ION: ION_TYPE [M]+*

PK$SPLASH: splash10-0006-9200000000-16357f038546002c5eb6
PK$NUM_PEAK: 43
PK$PEAK: m/z int. rel.int.
  15 1.39 14
  27 18.95 190
  29 7.58 76
  38 1.48 15
  39 31.24 312
  40 5.96 60
  41 37.83 378
  42 2.93 29
  43 5.29 53
  50 1.95 20
  51 9 90
  52 4.5 45
  53 17.02 170
  54 1.92 19
  55 10.93 109
  63 3.03 30
  65 10.54 105
  66 8.25 83
  67 29.86 299
  68 17.47 175
  69 7.05 71
  70 1.55 16
  77 23.75 238
  78 5.14 51
  79 37.45 375
  80 10.15 102
  81 7.72 77
  82 4.76 48
  91 27.08 271
  92 11.11 111
  93 99.99 999
  94 16.83 168
  95 19.17 192
  96 1.12 11
  103 1.1 11
  105 6.07 61
  106 1.5 15
  107 28.93 289
  108 9.63 96
  121 66.96 670
  122 6.53 65
  136 16.35 164
  137 1.53 15