ACCESSION: MSBNK-Fac_Eng_Univ_Tokyo-JP007298
RECORD_TITLE: (2R,3S)-4-(TERT-BUTYLDIMETHYLSILYLOXY)BUTAN-1,2,3-TRIOL 1,3-ISOPROPYLIDENE ACETAL; EI-B; MS
DATE: 2016.01.19 (Created 2008.10.21, modified 2011.05.06)
AUTHORS: ITO S, DEPT. OF CHEM., TOHOKU UNIV.
LICENSE: CC BY-NC-SA

CH$NAME: (2R,3S)-4-(TERT-BUTYLDIMETHYLSILYLOXY)BUTAN-1,2,3-TRIOL 1,3-ISOPROPYLIDENE ACETAL
CH$COMPOUND_CLASS: N/A
CH$FORMULA: C13H28O4Si
CH$EXACT_MASS: 276.17569
CH$SMILES: CC(C)(O1)OC([H])(CO[Si](C)(C)C(C)(C)C)C([H])(O)C1
CH$IUPAC: InChI=1S/C13H28O4Si/c1-12(2,3)18(6,7)16-9-11-10(14)8-15-13(4,5)17-11/h10-11,14H,8-9H2,1-7H3/t10-,11+/m1/s1
CH$LINK: INCHIKEY FSMGSCCKIWXNAF-MNOVXSKESA-N

AC$INSTRUMENT: HITACHI M-52
AC$INSTRUMENT_TYPE: EI-B
AC$MASS_SPECTROMETRY: MS_TYPE MS
AC$MASS_SPECTROMETRY: ION_MODE POSITIVE
AC$MASS_SPECTROMETRY: IONIZATION_ENERGY 14 eV

MS$FOCUSED_ION: ION_TYPE [M]+*

PK$SPLASH: splash10-03e9-1910000000-6f1693a138a5c50192da
PK$NUM_PEAK: 36
PK$PEAK: m/z int. rel.int.
  41 2 20
  43 4.7 47
  56 6.1 61
  58 0.4 4
  59 12.5 125
  68 2 20
  69 13.8 138
  75 2.5 25
  93 2.2 22
  101 40.9 409
  102 3.2 32
  103 0.4 4
  105 3.8 38
  117 50 500
  118 8.1 81
  119 0.26 3
  129 4.2 42
  131 65.2 652
  132 12.1 121
  133 0.59 6
  143 44.7 447
  144 4 40
  145 3 30
  159 1.46 15
  161 99.99 999
  162 19.7 197
  163 7.1 71
  175 1.05 11
  201 8.9 89
  203 2.7 27
  219 9.1 91
  243 0.28 3
  261 15.9 159
  262 3.2 32
  263 1.4 14
  277 0.6 6