ACCESSION: MSBNK-Fac_Eng_Univ_Tokyo-JP008003
RECORD_TITLE: (5S,8AS)-(-)-5ALPHA-ALLYL-5BETA,8ABETA-DIMETHYL-3,4,4A,5,6,7,8,8A-OCTAHYDRONAPHTHALEN-1(2H)-ONE ETHYLENE ACETAL; EI-B; MS
DATE: 2016.01.19 (Created 2008.10.21, modified 2011.05.06)
AUTHORS: HISAHIRO HAGIWARA, CHEMICAL RESEARCH INSTITUTE OF NON-AQUEOUSSOLUTIONS TOHOKU UNIV.
LICENSE: CC BY-NC-SA

CH$NAME: (5S,8AS)-(-)-5ALPHA-ALLYL-5BETA,8ABETA-DIMETHYL-3,4,4A,5,6,7,8,8A-OCTAHYDRONAPHTHALEN-1(2H)-ONE ETHYLENE ACETAL
CH$COMPOUND_CLASS: N/A
CH$FORMULA: C17H28O2
CH$EXACT_MASS: 264.20893
CH$SMILES: C=CCC(C)(C3)C([H])(C1)C(C)(CC3)C(O2)(OCC2)CC1
CH$IUPAC: InChI=1S/C17H28O2/c1-4-8-15(2)9-6-10-16(3)14(15)7-5-11-17(16)18-12-13-19-17/h4,14H,1,5-13H2,2-3H3/t14-,15+,16-/m0/s1
CH$LINK: INCHIKEY UCBVADQAJVJIJU-XHSDSOJGSA-N

AC$INSTRUMENT: JEOL JMS-DX-300
AC$INSTRUMENT_TYPE: EI-B
AC$MASS_SPECTROMETRY: MS_TYPE MS
AC$MASS_SPECTROMETRY: ION_MODE POSITIVE
AC$MASS_SPECTROMETRY: IONIZATION_ENERGY 70 eV

MS$FOCUSED_ION: ION_TYPE [M]+*

PK$SPLASH: splash10-001j-9100000000-bb9f39c9024fdb3bbbd5
PK$NUM_PEAK: 25
PK$PEAK: m/z int. rel.int.
  31 73.81 738
  32 74.93 749
  40 15.3 153
  41 19.14 191
  42 6.1 61
  43 49.69 497
  45 35.05 351
  55 16.42 164
  58 18.18 182
  59 47.39 474
  67 7.35 74
  69 8.22 82
  73 7.58 76
  74 33.13 331
  81 6.42 64
  86 25.48 255
  87 23 230
  99 99.99 999
  100 27.86 279
  104 5.35 54
  105 5.48 55
  125 20.42 204
  161 17.87 179
  223 33.45 335
  264 17.25 173