ACCESSION: MSBNK-Fac_Eng_Univ_Tokyo-JP008013
RECORD_TITLE: (4AS,5S,8AS)-8ABETA-METHOXYMETHOXYMETHYL-5BETA-METHYL-5ALPHA-(3-OXOPROPYL)-3,4,4A,5,6,7,8,8A-OCTAHYDRONAPHTHALEN-1(2H)-ONE 1-ETHYLENE ACETAL; EI-B; MS
DATE: 2016.01.19 (Created 2008.10.21, modified 2011.05.06)
AUTHORS: HISAHIRO HAGIWARA, CHEMICAL RESEARCH INSTITUTE OF NON-AQUEOUSSOLUTIONS TOHOKU UNIV.
LICENSE: CC BY-NC-SA

CH$NAME: (4AS,5S,8AS)-8ABETA-METHOXYMETHOXYMETHYL-5BETA-METHYL-5ALPHA-(3-OXOPROPYL)-3,4,4A,5,6,7,8,8A-OCTAHYDRONAPHTHALEN-1(2H)-ONE 1-ETHYLENE ACETAL
CH$COMPOUND_CLASS: N/A
CH$FORMULA: C19H32O5
CH$EXACT_MASS: 340.22497
CH$SMILES: COCOCC(C1)(C(O3)(OCC3)2)C([H])(CCC2)C(C)(CCC=O)CC1
CH$IUPAC: InChI=1S/C19H32O5/c1-17(8-5-11-20)7-4-9-18(14-22-15-21-2)16(17)6-3-10-19(18)23-12-13-24-19/h11,16H,3-10,12-15H2,1-2H3/t16-,17-,18+/m0/s1
CH$LINK: INCHIKEY PHAHWBNBFFHHAV-OKZBNKHCSA-N

AC$INSTRUMENT: JEOL JMS-DX-300
AC$INSTRUMENT_TYPE: EI-B
AC$MASS_SPECTROMETRY: MS_TYPE MS
AC$MASS_SPECTROMETRY: ION_MODE POSITIVE
AC$MASS_SPECTROMETRY: IONIZATION_ENERGY 70 eV

MS$FOCUSED_ION: ION_TYPE [M]+*

PK$SPLASH: splash10-000b-9210000000-1e55c7744aaee601321d
PK$NUM_PEAK: 49
PK$PEAK: m/z int. rel.int.
  40 48 480
  41 15.46 155
  42 12.28 123
  43 9.83 98
  44 9.75 98
  45 54.92 549
  55 26.69 267
  57 7.43 74
  58 33.87 339
  59 5.26 53
  67 10.52 105
  69 9.21 92
  71 14.04 140
  73 17.64 176
  79 6.92 69
  81 11.25 113
  83 5.49 55
  85 5.47 55
  86 49.16 492
  87 30.64 306
  91 7.83 78
  93 9.05 91
  95 11.51 115
  99 99.99 999
  100 17.7 177
  101 5.14 51
  103 7.29 73
  105 6.25 63
  107 8.5 85
  109 5.48 55
  112 6.77 68
  113 14.44 144
  123 5.26 53
  133 6.25 63
  135 7.35 74
  147 5.96 60
  149 6.52 65
  159 7.53 75
  177 5.45 55
  189 5.62 56
  217 5.96 60
  221 9.87 99
  223 12.67 127
  251 14.66 147
  252 7.02 70
  267 5.52 55
  279 9.47 95
  295 14.13 141
  340 0.53 5