ACCESSION: MSBNK-Fac_Eng_Univ_Tokyo-JP008340
RECORD_TITLE: TRIBUTYL PHOSPHITE; EI-B; MS
DATE: 2016.01.19 (Created 2008.10.21, modified 2011.05.06)
AUTHORS: UBE SCIENTIFIC ANALYSIS LABORATORY
LICENSE: CC BY-NC-SA

CH$NAME: TRIBUTYL PHOSPHITE
CH$COMPOUND_CLASS: N/A
CH$FORMULA: C12H27O3P
CH$EXACT_MASS: 250.16978
CH$SMILES: N/A
CH$IUPAC: N/A

AC$INSTRUMENT: HITACHI M-60
AC$INSTRUMENT_TYPE: EI-B
AC$MASS_SPECTROMETRY: MS_TYPE MS
AC$MASS_SPECTROMETRY: ION_MODE POSITIVE
AC$MASS_SPECTROMETRY: IONIZATION_ENERGY 70 eV

MS$FOCUSED_ION: ION_TYPE [M]+*

PK$SPLASH: splash10-00sl-9200000000-c3393bf72af1719f64ce
PK$NUM_PEAK: 45
PK$PEAK: m/z int. rel.int.
  15 4.8 48
  17 19.7 197
  18 57.28 573
  27 18.5 185
  29 37.97 380
  31 7.05 71
  39 10.33 103
  41 41.25 413
  42 10.65 107
  43 28.77 288
  44 8.18 82
  45 21.46 215
  51 6.2 62
  55 19.48 195
  56 18.64 186
  57 37.34 373
  60 6.88 69
  65 5.73 57
  69 9.55 96
  70 2.75 28
  71 4.46 45
  73 4.44 44
  77 12.67 127
  78 1.42 14
  79 2.14 21
  81 2.43 24
  82 3.86 39
  83 99.99 999
  84 1 10
  85 2.01 20
  91 5.02 50
  97 5.48 55
  99 5.25 53
  104 5.79 58
  105 6.19 62
  106 1.63 16
  109 3.43 34
  120 57.27 573
  121 38.15 382
  122 2.67 27
  123 1.79 18
  139 13.34 133
  149 4.77 48
  177 1.25 13
  195 4.77 48