ACCESSION: MSBNK-Fac_Eng_Univ_Tokyo-JP008341
RECORD_TITLE: TRIPHENYL PHOSPHITE; EI-B; MS
DATE: 2016.01.19 (Created 2008.10.21, modified 2011.05.06)
AUTHORS: UBE SCIENTIFIC ANALYSIS LABORATORY
LICENSE: CC BY-NC-SA

CH$NAME: TRIPHENYL PHOSPHITE
CH$COMPOUND_CLASS: N/A
CH$FORMULA: C18H15O3P
CH$EXACT_MASS: 310.07588
CH$SMILES: N/A
CH$IUPAC: N/A

AC$INSTRUMENT: HITACHI M-60
AC$INSTRUMENT_TYPE: EI-B
AC$MASS_SPECTROMETRY: MS_TYPE MS
AC$MASS_SPECTROMETRY: ION_MODE POSITIVE
AC$MASS_SPECTROMETRY: IONIZATION_ENERGY 70 eV

MS$FOCUSED_ION: ION_TYPE [M]+*

PK$SPLASH: splash10-016r-9231000000-5edb0f62652e224fe6d6
PK$NUM_PEAK: 44
PK$PEAK: m/z int. rel.int.
  27 4.54 45
  29 1.32 13
  37 2.18 22
  38 5.96 60
  39 27.72 277
  40 7.42 74
  47 9.05 91
  50 6.53 65
  51 33.13 331
  52 1.75 18
  53 1.52 15
  55 4.6 46
  61 1.01 10
  62 2.4 24
  63 5.92 59
  64 2.83 28
  65 23.21 232
  66 19.07 191
  74 1.55 16
  75 1.26 13
  76 2.49 25
  77 86.24 862
  78 7 70
  93 3.45 35
  94 56.52 565
  95 4.4 44
  115 1.5 15
  139 1.99 20
  140 5.66 57
  141 2.61 26
  151 4.72 47
  152 12.32 123
  153 23.31 233
  154 5.61 56
  170 7.7 77
  199 7.33 73
  216 1.51 15
  217 99.99 999
  218 15.44 154
  219 1.21 12
  234 3.23 32
  309 8.04 80
  310 36.7 367
  311 7.04 70