ACCESSION: MSBNK-Fac_Eng_Univ_Tokyo-JP008344
RECORD_TITLE: TRIDICHLOROPROPYL PHOSPHITE; EI-B; MS
DATE: 2016.01.19 (Created 2008.10.21, modified 2011.05.06)
AUTHORS: UBE SCIENTIFIC ANALYSIS LABORATORY
LICENSE: CC BY-NC-SA

CH$NAME: TRIDICHLOROPROPYL PHOSPHITE
CH$NAME: TRIS(2,3-DICHLOROPROPYL)PHOSPHITE
CH$COMPOUND_CLASS: N/A
CH$FORMULA: C9H15Cl6O3P
CH$EXACT_MASS: 411.889
CH$SMILES: N/A
CH$IUPAC: N/A

AC$INSTRUMENT: HITACHI M-60
AC$INSTRUMENT_TYPE: EI-B
AC$MASS_SPECTROMETRY: MS_TYPE MS
AC$MASS_SPECTROMETRY: ION_MODE POSITIVE
AC$MASS_SPECTROMETRY: IONIZATION_ENERGY 70 eV

MS$FOCUSED_ION: ION_TYPE [M]+*

PK$SPLASH: splash10-004i-9201000000-99b9f188a3c7ab7ecc8a
PK$NUM_PEAK: 75
PK$PEAK: m/z int. rel.int.
  15 41.03 410
  27 27.18 272
  29 51.38 514
  31 21.16 212
  36 1.95 20
  38 1.9 19
  39 32.6 326
  40 2.92 29
  41 25.92 259
  42 5.76 58
  43 48.31 483
  44 22.59 226
  45 8.07 81
  49 38.43 384
  51 12.5 125
  55 1.73 17
  57 41.64 416
  58 1.6 16
  61 16.25 163
  62 5.58 56
  63 3.11 31
  65 1.98 20
  75 99.99 999
  76 7.44 74
  77 36.23 362
  78 4.67 47
  79 82.98 830
  80 1.83 18
  81 32.09 321
  83 3.05 31
  88 1.81 18
  91 1.69 17
  92 2.07 21
  93 28.04 280
  95 7.69 77
  99 74.41 744
  110 2.77 28
  111 13.48 135
  112 1.93 19
  113 8.5 85
  117 2.92 29
  121 4.51 45
  123 9.09 91
  125 2.64 26
  135 7.77 78
  137 9.14 91
  141 2.03 20
  155 18.94 189
  157 5.63 56
  159 9.31 93
  161 2.66 27
  173 4.38 44
  191 54.79 548
  192 1.54 15
  193 26.79 268
  195 5.14 51
  209 39.07 391
  211 21.13 211
  213 3.22 32
  269 2.97 30
  271 3.08 31
  301 7.11 71
  303 9.8 98
  305 4.92 49
  319 16.1 161
  321 19.46 195
  323 9.39 94
  325 1.86 19
  379 15 150
  380 1.24 12
  381 23.79 238
  382 2.23 22
  383 16.75 168
  384 1.16 12
  385 5.08 51