ACCESSION: MSBNK-Fac_Eng_Univ_Tokyo-JP008346
RECORD_TITLE: TRIPHENYL PHOSPHINE; EI-B; MS
DATE: 2016.01.19 (Created 2008.10.21, modified 2011.05.06)
AUTHORS: UBE SCIENTIFIC ANALYSIS LABORATORY
LICENSE: CC BY-NC-SA

CH$NAME: TRIPHENYL PHOSPHINE
CH$COMPOUND_CLASS: N/A
CH$FORMULA: C18H15P
CH$EXACT_MASS: 262.09114
CH$SMILES: N/A
CH$IUPAC: N/A

AC$INSTRUMENT: HITACHI M-60
AC$INSTRUMENT_TYPE: EI-B
AC$MASS_SPECTROMETRY: MS_TYPE MS
AC$MASS_SPECTROMETRY: ION_MODE POSITIVE
AC$MASS_SPECTROMETRY: IONIZATION_ENERGY 70 eV

MS$FOCUSED_ION: ION_TYPE [M]+*

PK$SPLASH: splash10-03e9-2960000000-648fc780914876703b34
PK$NUM_PEAK: 34
PK$PEAK: m/z int. rel.int.
  18 4.17 42
  39 4.82 48
  50 2.59 26
  51 10.92 109
  57 6.08 61
  63 2.01 20
  65 1.87 19
  77 3.9 39
  78 1.1 11
  81 4.03 40
  83 1.64 16
  107 19.97 200
  108 34.1 341
  109 3.06 31
  115 4.87 49
  128 1.55 16
  131 2.32 23
  133 3.86 39
  139 1.82 18
  141 1.67 17
  152 8.82 88
  153 1.93 19
  154 2.34 23
  157 4.89 49
  170 2.8 28
  181 1.25 13
  183 61.63 616
  184 14.73 147
  185 9.34 93
  260 1.53 15
  261 16.4 164
  262 99.99 999
  263 20.8 208
  264 1.83 18