ACCESSION: MSBNK-Fac_Eng_Univ_Tokyo-JP008387
RECORD_TITLE: CARYOPHYLLENE ALCOHOL; EI-B; MS
DATE: 2016.01.19 (Created 2008.10.21, modified 2011.05.06)
AUTHORS: SODA AROMATIC CO., LTD.
LICENSE: CC BY-NC-SA

CH$NAME: CARYOPHYLLENE ALCOHOL
CH$NAME: 4,4,8-TRIMETHYLTRICYCLO(6.3.1.0(2,5))-DODECAN-1-OL
CH$COMPOUND_CLASS: N/A
CH$FORMULA: C15H26O
CH$EXACT_MASS: 222.19837
CH$SMILES: N/A
CH$IUPAC: N/A

AC$INSTRUMENT: HITACHI M-80B
AC$INSTRUMENT_TYPE: EI-B
AC$MASS_SPECTROMETRY: MS_TYPE MS
AC$MASS_SPECTROMETRY: ION_MODE POSITIVE
AC$MASS_SPECTROMETRY: IONIZATION_ENERGY 70 eV

MS$FOCUSED_ION: ION_TYPE [M]+*

PK$SPLASH: splash10-03dl-9700000000-916078f79087ad582752
PK$NUM_PEAK: 79
PK$PEAK: m/z int. rel.int.
  27 8.7 87
  29 11.45 115
  31 1.12 11
  39 10.83 108
  40 1.93 19
  41 42.9 429
  42 3.78 38
  43 16.88 169
  51 1.23 12
  53 10.73 107
  54 3.19 32
  55 35.18 352
  56 6.43 64
  57 3.84 38
  58 1.45 15
  59 12.24 122
  65 3.31 33
  66 1.29 13
  67 15.12 151
  68 5.15 52
  69 23.64 236
  70 4.3 43
  71 2.2 22
  77 7.01 70
  78 1.19 12
  79 8.74 87
  80 2.07 21
  81 27.75 278
  82 6.6 66
  83 10.75 108
  84 1.64 16
  85 1.23 12
  91 6.5 65
  92 1.32 13
  93 9.99 100
  94 3.92 39
  95 22.1 221
  96 8.11 81
  97 6.48 65
  98 1.75 18
  105 4.05 41
  106 1.2 12
  107 5.78 58
  108 5.75 58
  109 12.43 124
  110 4.45 45
  111 99.99 999
  112 7.59 76
  119 2.51 25
  120 1.31 13
  121 12.04 120
  122 2.53 25
  123 29.09 291
  124 2.99 30
  125 1.17 12
  133 3.27 33
  135 7.05 71
  136 2.08 21
  137 2.54 25
  138 1.37 14
  139 1.1 11
  147 1.35 14
  148 1.31 13
  149 6.3 63
  150 6.57 66
  151 4.85 49
  161 18.17 182
  162 2.46 25
  164 5.54 55
  165 4.23 42
  166 4.77 48
  167 1.01 10
  175 3.14 31
  179 9.9 99
  180 1.26 13
  189 4.1 41
  204 10.12 101
  205 1.56 16
  207 4.15 42