ACCESSION: MSBNK-Fac_Eng_Univ_Tokyo-JP008576
RECORD_TITLE: NAPHTHALENE; EI-B; MS
DATE: 2016.01.19 (Created 2008.10.21, modified 2011.05.06)
AUTHORS: SODA AROMATIC CO., LTD.
LICENSE: CC BY-NC-SA

CH$NAME: NAPHTHALENE
CH$COMPOUND_CLASS: N/A
CH$FORMULA: C10H8
CH$EXACT_MASS: 128.06260
CH$SMILES: c(c2)cc(c1)c(c2)ccc1
CH$IUPAC: InChI=1S/C10H8/c1-2-6-10-8-4-3-7-9(10)5-1/h1-8H
CH$LINK: INCHIKEY UFWIBTONFRDIAS-UHFFFAOYSA-N
CH$LINK: COMPTOX DTXSID8020913

AC$INSTRUMENT: HITACHI M-80B
AC$INSTRUMENT_TYPE: EI-B
AC$MASS_SPECTROMETRY: MS_TYPE MS
AC$MASS_SPECTROMETRY: ION_MODE POSITIVE
AC$MASS_SPECTROMETRY: IONIZATION_ENERGY 70 eV

MS$FOCUSED_ION: ION_TYPE [M]+*

PK$SPLASH: splash10-004i-4900000000-c780f74ca6838fbab7d8
PK$NUM_PEAK: 24
PK$PEAK: m/z int. rel.int.
  27 1 10
  38 1.23 12
  39 3.31 33
  50 5.48 55
  51 10.75 108
  52 1.44 14
  61 1.37 14
  62 2.8 28
  63 7.52 75
  64 5.06 51
  74 4.98 50
  75 5.23 52
  76 3.41 34
  77 3.62 36
  78 2.88 29
  86 1.17 12
  87 1.88 19
  98 1.53 15
  101 2.74 27
  102 10.61 106
  126 5.64 56
  127 11.82 118
  128 99.99 999
  129 12 120