ACCESSION: MSBNK-Fac_Eng_Univ_Tokyo-JP008849
RECORD_TITLE: TRIMETHOXYVINYLSILANE; EI-B; MS
DATE: 2016.01.19 (Created 2008.10.21, modified 2011.05.06)
AUTHORS: TAJIMA S, GUNMA COLLEGE OF TECHNOLOGY
LICENSE: CC BY-NC-SA

CH$NAME: TRIMETHOXYVINYLSILANE
CH$COMPOUND_CLASS: N/A
CH$FORMULA: C5H12O3Si
CH$EXACT_MASS: 148.05557
CH$SMILES: C=C[Si](OC)(OC)OC
CH$IUPAC: InChI=1S/C5H12O3Si/c1-5-9(6-2,7-3)8-4/h5H,1H2,2-4H3
CH$LINK: INCHIKEY NKSJNEHGWDZZQF-UHFFFAOYSA-N
CH$LINK: COMPTOX DTXSID2029240

AC$INSTRUMENT: HITACHI RMU-7M
AC$INSTRUMENT_TYPE: EI-B
AC$MASS_SPECTROMETRY: MS_TYPE MS
AC$MASS_SPECTROMETRY: ION_MODE POSITIVE
AC$MASS_SPECTROMETRY: IONIZATION_ENERGY 70 eV

MS$FOCUSED_ION: ION_TYPE [M]+*

PK$SPLASH: splash10-00dl-6900000000-b5bf9b21021459eb629a
PK$NUM_PEAK: 39
PK$PEAK: m/z int. rel.int.
  15 3.84 38
  27 2.4 24
  29 2.8 28
  31 3.6 36
  45 8.09 81
  47 3.2 32
  55 2 20
  57 2.08 21
  59 21.86 219
  60 5.6 56
  61 17.77 178
  73 1.84 18
  77 3.44 34
  85 2.8 28
  86 4 40
  87 16.49 165
  88 1.68 17
  90 13.61 136
  91 82.31 823
  92 6.81 68
  93 4.16 42
  105 11.93 119
  106 1.68 17
  107 31.63 316
  108 2.64 26
  109 1.52 15
  115 1.92 19
  116 2.24 22
  117 22.58 226
  118 34.43 344
  119 6.57 66
  120 16.49 165
  121 99.99 999
  122 9.21 92
  123 4.24 42
  130 1.68 17
  133 19.54 195
  134 2.56 26
  147 3.84 38