ACCESSION: MSBNK-Fac_Eng_Univ_Tokyo-JP008855
RECORD_TITLE: 1,3-DIOXOLANE; EI-B; MS
DATE: 2016.01.19 (Created 2008.10.21, modified 2011.05.06)
AUTHORS: TAJIMA S, GUNMA COLLEGE OF TECHNOLOGY
LICENSE: CC BY-NC-SA

CH$NAME: 1,3-DIOXOLANE
CH$NAME: 1,3-DIOXACYCLOPENTANE
CH$COMPOUND_CLASS: N/A
CH$FORMULA: C3H6O2
CH$EXACT_MASS: 74.03678
CH$SMILES: C(C1)OCO1
CH$IUPAC: InChI=1S/C3H6O2/c1-2-5-3-4-1/h1-3H2
CH$LINK: INCHIKEY WNXJIVFYUVYPPR-UHFFFAOYSA-N
CH$LINK: COMPTOX DTXSID4027284

AC$INSTRUMENT: HITACHI RMU-7M
AC$INSTRUMENT_TYPE: EI-B
AC$MASS_SPECTROMETRY: MS_TYPE MS
AC$MASS_SPECTROMETRY: ION_MODE POSITIVE
AC$MASS_SPECTROMETRY: IONIZATION_ENERGY 70 eV

MS$FOCUSED_ION: ION_TYPE [M]+*

PK$SPLASH: splash10-00dl-9000000000-40ce4f986bb39df796b5
PK$NUM_PEAK: 18
PK$PEAK: m/z int. rel.int.
  14 3.48 35
  15 16.04 160
  29 38.07 381
  30 2.14 21
  31 7.43 74
  41 4.33 43
  42 4.39 44
  43 23.96 240
  44 57.06 571
  45 26.52 265
  55 3.16 32
  56 1.34 13
  57 4.81 48
  69 1.87 19
  71 2.19 22
  73 99.99 999
  74 6.52 65
  75 1 10