ACCESSION: MSBNK-Fac_Eng_Univ_Tokyo-JP008866
RECORD_TITLE: TRIETHYL PHOSPHITE; EI-B; MS
DATE: 2016.01.19 (Created 2008.10.21, modified 2011.05.06)
AUTHORS: TAJIMA S, GUNMA COLLEGE OF TECHNOLOGY
LICENSE: CC BY-NC-SA

CH$NAME: TRIETHYL PHOSPHITE
CH$COMPOUND_CLASS: N/A
CH$FORMULA: C6H15O3P
CH$EXACT_MASS: 166.07588
CH$SMILES: N/A
CH$IUPAC: N/A

AC$INSTRUMENT: HITACHI RMU-7M
AC$INSTRUMENT_TYPE: EI-B
AC$MASS_SPECTROMETRY: MS_TYPE MS
AC$MASS_SPECTROMETRY: ION_MODE POSITIVE
AC$MASS_SPECTROMETRY: IONIZATION_ENERGY 70 eV

MS$FOCUSED_ION: ION_TYPE [M]+*

PK$SPLASH: splash10-00lr-9400000000-65fefb18e9edb1c02a23
PK$NUM_PEAK: 33
PK$PEAK: m/z int. rel.int.
  15 3.35 34
  19 3.76 38
  26 2.74 27
  27 26.88 269
  28 3.83 38
  29 60.4 604
  31 7.66 77
  43 10.26 103
  45 13.54 135
  47 14.71 147
  48 4.31 43
  65 96.44 964
  66 5.47 55
  76 4.24 42
  81 45.69 457
  82 99.99 999
  83 65.53 655
  91 15.6 156
  92 4.79 48
  93 44.25 443
  94 8.89 89
  106 1.78 18
  109 20.73 207
  110 13.13 131
  111 68.19 682
  112 1.71 17
  121 42 420
  122 18.81 188
  138 6.16 62
  139 62.59 626
  140 2.87 29
  166 51.44 514
  167 3.97 40