ACCESSION: MSBNK-Fac_Eng_Univ_Tokyo-JP009301
RECORD_TITLE: BUTANE; EI-B; MS
DATE: 2016.01.19 (Created 2008.10.21, modified 2011.05.06)
AUTHORS: YAMAMOTO M, DEP. CHEMISTRY, FAC. SCIENCE, NARA WOMEN'S UNIV.
LICENSE: CC BY-NC-SA

CH$NAME: BUTANE
CH$COMPOUND_CLASS: N/A
CH$FORMULA: C4H10
CH$EXACT_MASS: 58.07825
CH$SMILES: CCCC
CH$IUPAC: InChI=1S/C4H10/c1-3-4-2/h3-4H2,1-2H3
CH$LINK: INCHIKEY IJDNQMDRQITEOD-UHFFFAOYSA-N
CH$LINK: COMPTOX DTXSID7024665

AC$INSTRUMENT: HITACHI RMU-6M
AC$INSTRUMENT_TYPE: EI-B
AC$MASS_SPECTROMETRY: MS_TYPE MS
AC$MASS_SPECTROMETRY: ION_MODE POSITIVE
AC$MASS_SPECTROMETRY: IONIZATION_ENERGY 20 eV

MS$FOCUSED_ION: ION_TYPE [M]+*

PK$SPLASH: splash10-0006-9000000000-c53118ac093be355768c
PK$NUM_PEAK: 9
PK$PEAK: m/z int. rel.int.
  27 7.3 73
  28 19.1 191
  29 24.5 245
  41 1.72 17
  42 11.9 119
  43 99.99 999
  44 3.1 31
  57 0.28 3
  58 13.1 131